program: Orca
programVersion: 4.2.1
elementType: S F F F F O O O O O O O N N N N C C C C C C C C C C C C C C C H H H H H H H H H H H H
charge: 0
multiplicity: 1
keywords: wb97x-d3
keywords: def2-TZVPP
keywords: def2/J RIJCOSX GRIDX6 NOFINALGRIDX
keywords: grid4 nofinalgrid
keywords: scfconv7
keywords: smallprint printgap noloewdin
keywords: NOSOSCF
formula: C15H12F4N4O7S
InChI: InChI=1S/C15H12F4N4O7S/c1-28-11(24)7-4-2-3-5-8(7)31(26,27)23-15(25)22-14-20-9(29-12(16)17)6-10(21-14)30-13(18)19/h2-6,12-13,22-23H,1H3
43 atoms
S  -2.442336 -0.101478 -1.665582
F  0.314467 4.285806 0.849817
F  0.354247 3.335077 -1.0942
F  7.017608 -1.574256 0.379233
F  5.252288 -2.43268 1.291054
O  -2.779345 -0.58648 -2.977511
O  -2.706375 1.266209 -1.274579
O  -3.608042 1.215959 2.026274
O  -1.541721 0.652948 1.386794
O  -0.677013 -2.507974 -1.862799
O  1.843582 2.809251 0.471987
O  5.258357 -0.33556 0.553381
N  -0.79665 -0.280072 -1.412101
N  1.184339 -1.474076 -1.12934
N  1.47982 0.700653 -0.349427
N  3.211194 -0.899465 -0.293102
C  -3.192095 -1.184491 -0.467675
C  -3.362324 -0.783364 0.857322
C  -3.709038 -2.385844 -0.922668
C  -4.078224 -1.607721 1.714832
C  -4.39504 -3.211174 -0.045105
C  -4.583683 -2.819629 1.268746
C  -2.725362 0.444146 1.421346
C  -0.159491 -1.483841 -1.500474
C  1.974674 -0.508296 -0.570255
C  2.292392 1.581367 0.209687
C  3.998168 0.000881 0.256906
C  3.602752 1.296506 0.549431
C  -3.115952 2.410227 2.627393
C  0.520893 3.128242 0.219149
C  5.686931 -1.62417 0.31431
H  -3.578922 -2.672465 -1.955682
H  -0.301374 0.509304 -0.99841
H  -4.233103 -1.308226 2.742583
H  -4.789404 -4.154579 -0.39633
H  -5.129524 -3.455116 1.952952
H  1.630385 -2.374111 -1.228684
H  4.258857 2.02113 1.005955
H  -2.374446 2.196543 3.397062
H  -3.978617 2.893937 3.075521
H  -2.676424 3.073051 1.882139
H  -0.182383 2.375333 0.57427
H  5.367264 -2.015176 -0.652057
totalener: -2122.24316122 hartree
nucrepener: 3571.81546355 hartree
electener: -5694.05862477 hartree
twoeener: 4331.48487524 hartree
kineticenergy: 2115.11773927 hartree
xcener: -170.293005700948 hartree
chargesum: -0.0000000
charge: 0.870330 -0.180126 -0.173008 -0.173076 -0.175859 -0.426713 -0.464452 -0.249995 -0.404670 -0.373051 -0.244128 -0.241470 -0.209472 -0.172030 -0.411665 -0.402614 -0.200421 0.105212 0.038340 -0.184208 -0.141259 -0.091885 0.425120 0.343626 0.382180 0.391203 0.377370 -0.289060 -0.140453 0.443831 0.402011 0.139968 0.213208 0.124202 0.137020 0.135128 0.170727 0.142722 0.114178 0.126709 0.116711 0.057723 0.092095
qa: 0.8703 -0.1801 -0.1730 -0.1731 -0.1759 -0.4267 -0.4645 -0.2500 -0.4047 -0.3731 -0.2441 -0.2415 -0.2095 -0.1720 -0.4117 -0.4026 -0.2004 0.1052 0.0383 -0.1842 -0.1413 -0.0919 0.4251 0.3436 0.3822 0.3912 0.3774 -0.2891 -0.1405 0.4438 0.4020 0.1400 0.2132 0.1242 0.1370 0.1351 0.1707 0.1427 0.1142 0.1267 0.1167 0.0577 0.0921
va: 5.8313 1.1144 1.1116 1.1187 1.1076 2.0863 2.0284 2.1504 2.0877 2.1446 2.1826 2.1644 3.1199 3.1897 2.9757 2.9649 3.9341 3.6749 3.8639 4.0707 3.9778 3.9423 4.1084 4.4100 4.2287 4.0273 4.0604 3.9496 3.8880 4.2827 4.2871 1.0272 1.0477 1.0181 0.9984 0.9979 1.0338 1.0154 0.9923 0.9959 0.9941 1.0057 0.9912
dispcorr: -0.024774197 hartree
energy: -2122.267935414774
dipole: -27.27912 27.04801 -0.23110 -5.95647 5.39095 -0.56553 7.78049 -5.98912 1.79137
magnitude: 1.89268 au
magnitude: 4.81082 debye
