program: Orca
programVersion: 4.2.1
elementType: S F F F F O O O O O O O N N N N C C C C C C C C C C C C C C C H H H H H H H H H H H H
charge: 0
multiplicity: 1
keywords: wb97x-d3
keywords: def2-TZVPP
keywords: def2/J RIJCOSX GRIDX6 NOFINALGRIDX
keywords: grid4 nofinalgrid
keywords: scfconv7
keywords: smallprint printgap noloewdin
keywords: NOSOSCF
formula: C15H12F4N4O7S
InChI: InChI=1S/C15H12F4N4O7S/c1-28-11(24)7-4-2-3-5-8(7)31(26,27)23-15(25)22-14-20-9(29-12(16)17)6-10(21-14)30-13(18)19/h2-6,12-13,22-23H,1H3
43 atoms
S  -2.478908 0.020085 -1.523324
F  0.404694 4.168658 1.207369
F  0.382755 3.368348 -0.803404
F  5.983745 -1.724113 -1.271096
F  6.825519 -1.948823 0.70965
O  -2.867478 -0.343887 -2.860003
O  -2.709122 1.350501 -1.0031
O  -3.491762 1.018738 2.306962
O  -1.457333 0.486498 1.550136
O  -0.746811 -2.376448 -2.001645
O  1.903805 2.707987 0.67927
O  5.277584 -0.471258 0.423985
N  -0.82964 -0.199344 -1.342093
N  1.147049 -1.427035 -1.235878
N  1.492348 0.674939 -0.29535
N  3.204065 -0.942468 -0.414691
C  -3.204254 -1.155541 -0.400178
C  -3.319094 -0.87358 0.96104
C  -3.759829 -2.302725 -0.941541
C  -4.019023 -1.760882 1.767171
C  -4.430254 -3.192855 -0.116819
C  -4.563928 -2.91899 1.233001
C  -2.642388 0.290923 1.607248
C  -0.207861 -1.393739 -1.563975
C  1.965039 -0.518297 -0.623777
C  2.330505 1.500363 0.308225
C  4.017933 -0.095032 0.178675
C  3.646129 1.176496 0.586298
C  -2.961673 2.152506 2.987749
C  0.579818 3.060475 0.485199
C  5.695759 -1.726998 0.037127
H  -3.672549 -2.496215 -2.000407
H  -0.308479 0.548533 -0.885021
H  -4.131726 -1.552986 2.822574
H  -4.85609 -4.093562 -0.536788
H  -5.098208 -3.604512 1.876822
H  1.586091 -2.311032 -1.446993
H  4.324383 1.856884 1.077227
H  -2.185085 1.869246 3.697993
H  -3.797574 2.597759 3.518577
H  -2.553731 2.87735 2.28328
H  -0.124275 2.290482 0.80053
H  4.967039 -2.509942 0.24878
totalener: -2122.24306071 hartree
nucrepener: 3569.60623096 hartree
electener: -5691.84929167 hartree
twoeener: 4329.21620563 hartree
kineticenergy: 2115.11932359 hartree
xcener: -170.293414172960 hartree
chargesum: -0.0000000
charge: 0.871556 -0.179795 -0.172129 -0.174233 -0.173540 -0.426244 -0.465192 -0.249607 -0.404168 -0.372356 -0.244024 -0.240576 -0.208368 -0.171341 -0.411400 -0.402309 -0.197651 0.101862 0.037478 -0.181834 -0.140991 -0.093003 0.422285 0.342696 0.381222 0.391950 0.377398 -0.289629 -0.139866 0.445130 0.401977 0.139751 0.212589 0.123558 0.136898 0.135235 0.170642 0.142659 0.113295 0.126950 0.116875 0.055179 0.091070
qa: 0.8716 -0.1798 -0.1721 -0.1742 -0.1735 -0.4262 -0.4652 -0.2496 -0.4042 -0.3724 -0.2440 -0.2406 -0.2084 -0.1713 -0.4114 -0.4023 -0.1977 0.1019 0.0375 -0.1818 -0.1410 -0.0930 0.4223 0.3427 0.3812 0.3919 0.3774 -0.2896 -0.1399 0.4451 0.4020 0.1398 0.2126 0.1236 0.1369 0.1352 0.1706 0.1427 0.1133 0.1270 0.1169 0.0552 0.0911
va: 5.8311 1.1149 1.1131 1.1097 1.1178 2.0866 2.0274 2.1496 2.0878 2.1456 2.1824 2.1640 3.1196 3.1905 2.9749 2.9658 3.9355 3.6772 3.8654 4.0685 3.9756 3.9423 4.1119 4.4105 4.2304 4.0251 4.0606 3.9507 3.8878 4.2855 4.2878 1.0273 1.0487 1.0183 0.9984 0.9978 1.0338 1.0154 0.9926 0.9960 0.9940 1.0048 0.9916
dispcorr: -0.024779173 hartree
energy: -2122.267839884079
dipole: -28.03411 27.65021 -0.38390 -7.60384 6.64273 -0.96111 11.27704 -8.89977 2.37726
magnitude: 2.59278 au
magnitude: 6.59031 debye
