program: Orca
programVersion: 5.0.2
elementType: S S O O O O O O O N N N N N N C C C C C C C C C C C C C C C C H H H H H H H H H H H H H H H H H H
charge: 0
multiplicity: 1
keywords: wb97x-d3
keywords: def2-TZVPP
keywords: def2/J RIJCOSX
keywords: DEFGRID2
keywords: scfconv7
keywords: smallprint printgap noloewdin
keywords: NOSOSCF
formula: C16H18N6O7S2
InChI: InChI=1S/C16H18N6O7S2/c1-4-30(24,25)13-14(22-8-6-5-7-10(22)17-13)31(26,27)21-16(23)20-15-18-11(28-2)9-12(19-15)29-3/h5-9,20-21H,4H2,1-3H3
49 atoms
S  -0.938129 1.087158 2.256322
S  -1.170659 -1.730879 -0.040118
O  0.343293 0.596167 1.756507
O  -1.073184 2.513084 2.534757
O  -1.785399 -2.655441 -0.96791
O  -0.794544 -2.194255 1.279384
O  -0.760956 -0.158703 -2.46408
O  4.11213 -1.320214 1.306285
O  5.797678 1.549965 -1.928726
N  -3.361325 -0.104009 -0.610819
N  -3.196833 1.529676 0.908908
N  0.234223 -1.148738 -0.68488
N  1.441187 0.21251 -2.125091
N  2.764359 -0.574178 -0.384487
N  3.613553 0.881807 -2.034911
C  -2.21952 -0.345782 0.128179
C  -2.174474 0.694011 1.04014
C  -3.92119 1.04625 -0.093471
C  -1.414684 0.167355 3.708367
C  -3.92185 -0.746451 -1.68111
C  -5.104082 1.560904 -0.643817
C  -0.394723 0.374276 4.814431
C  -5.064108 -0.250803 -2.218245
C  -5.672544 0.912797 -1.698296
C  0.238542 -0.356951 -1.800737
C  2.658959 0.16385 -1.474908
C  3.951932 -0.595417 0.212794
C  4.792738 0.851819 -1.428282
C  5.034537 0.116172 -0.274208
C  2.998256 -2.044963 1.828205
C  5.58275 2.330933 -3.102726
H  -2.405415 0.524333 3.992022
H  -1.49249 -0.879292 3.417113
H  -3.43578 -1.628658 -2.056082
H  -5.525337 2.459368 -0.216629
H  -0.731753 -0.169039 5.69537
H  -0.297188 1.422836 5.09007
H  0.584783 -0.013382 4.540753
H  -5.499237 -0.768056 -3.060364
H  -6.583041 1.2878 -2.143555
H  1.416596 0.78932 -2.956919
H  5.999727 0.101641 0.210329
H  2.60085 -2.755427 1.103333
H  2.206116 -1.373924 2.159033
H  3.380621 -2.590321 2.686639
H  5.29696 1.711567 -3.952323
H  6.535463 2.808562 -3.313773
H  4.825871 3.098204 -2.942919
H  1.096642 -1.190941 -0.118219
elementType: S O N C H
totalener: -2272.21806675 hartree
nucrepener: 3806.62350963 hartree
electener: -6078.84157638 hartree
twoeener: 4613.35304676 hartree
cpcmener: -0.05815716 hartree
kineticenergy: 2264.54128566 hartree
xcener: -174.188662928873 hartree
chargesum: 0.0000000
charge: 0.875103 0.883534 -0.553162 -0.552978 -0.503714 -0.507059 -0.497136 -0.298107 -0.299103 0.057766 -0.348446 -0.195018 -0.131485 -0.431550 -0.433811 -0.129937 0.060334 0.249077 -0.124727 0.003936 -0.222321 -0.262130 -0.179617 -0.078052 0.392138 0.375834 0.422977 0.425323 -0.323178 -0.113536 -0.115299 0.134780 0.137522 0.185480 0.155497 0.106445 0.101446 0.100725 0.168646 0.172258 0.192688 0.145405 0.116030 0.102877 0.139857 0.113860 0.131958 0.114275 0.234596
qa: 0.8751 0.8835 -0.5532 -0.5530 -0.5037 -0.5071 -0.4971 -0.2981 -0.2991 0.0578 -0.3484 -0.1950 -0.1315 -0.4315 -0.4338 -0.1299 0.0603 0.2491 -0.1247 0.0039 -0.2223 -0.2621 -0.1796 -0.0781 0.3921 0.3758 0.4230 0.4253 -0.3232 -0.1135 -0.1153 0.1348 0.1375 0.1855 0.1555 0.1064 0.1014 0.1007 0.1686 0.1723 0.1927 0.1454 0.1160 0.1029 0.1399 0.1139 0.1320 0.1143 0.2346
va: 5.4963 5.8622 1.9172 1.9283 1.9889 1.9836 2.0133 2.1332 2.1224 3.5011 3.1349 3.0850 3.1838 2.9666 2.9685 3.8722 4.0182 3.9394 3.8228 3.8670 3.9628 3.9458 3.9154 3.9032 4.3823 4.2481 3.9914 4.0123 3.9353 3.8394 3.8480 1.0161 1.0160 1.0074 1.0057 1.0007 1.0107 1.0064 0.9909 0.9840 1.0165 1.0166 0.9938 0.9989 0.9937 0.9954 0.9935 0.9954 1.0407
dispcorr: -0.029821233 hartree
energy: -2272.247887981845
dipole: 7.66543 -8.29129 -0.62586 2.17973 -2.61753 -0.43780 7.48271 -8.30795 -0.82524
magnitude: 1.12446 au
magnitude: 2.85814 debye
