program: Orca
programVersion: 5.0.2
elementType: S S O O O O O O O N N N N N N C C C C C C C C C C C C C C C C H H H H H H H H H H H H H H H H H H
charge: 0
multiplicity: 1
keywords: wb97x-d3
keywords: def2-TZVPP
keywords: def2/J RIJCOSX
keywords: DEFGRID2
keywords: scfconv7
keywords: smallprint printgap noloewdin
keywords: NOSOSCF
formula: C16H18N6O7S2
InChI: InChI=1S/C16H18N6O7S2/c1-4-30(24,25)13-14(22-8-6-5-7-10(22)17-13)31(26,27)21-16(23)20-15-18-11(28-2)9-12(19-15)29-3/h5-9,20-21H,4H2,1-3H3
49 atoms
S  -0.597663 -0.77441 -2.347351
S  -1.429844 1.85833 -0.015249
O  -1.086306 -0.398718 -3.669665
O  0.535627 -0.048255 -1.780877
O  -2.259332 2.660001 0.858027
O  -1.032978 2.390729 -1.301572
O  -0.990896 0.226114 2.359658
O  3.949977 2.068542 -1.045746
O  5.440046 -1.637719 1.316137
N  -3.394578 -0.089275 0.338102
N  -2.886122 -1.59862 -1.231592
N  -0.006014 1.474917 0.745041
N  1.22365 -0.038704 2.015177
N  2.582201 1.053123 0.481002
N  3.32487 -0.843818 1.670921
C  -2.227255 0.328169 -0.270096
C  -1.962784 -0.643499 -1.214565
C  -3.757957 -1.26498 -0.286071
C  -0.210887 -2.516824 -2.316298
C  -4.112539 0.412568 1.388481
C  -4.916889 -1.942641 0.121019
C  0.335534 -2.964069 -0.976168
C  -5.229543 -0.243014 1.790312
C  -5.648095 -1.430341 1.150232
C  0.012722 0.541261 1.749482
C  2.428612 0.068088 1.346023
C  3.750464 1.117225 -0.15041
C  4.491949 -0.756833 1.046215
C  4.776138 0.222947 0.102644
C  2.903952 3.003155 -1.307468
C  5.168913 -2.688483 2.24102
H  -1.108147 -3.059407 -2.610658
H  0.52737 -2.631633 -3.114455
H  -3.761917 1.313114 1.859111
H  -5.189903 -2.85597 -0.38747
H  0.579955 -4.02321 -1.040122
H  -0.389615 -2.842949 -0.172393
H  1.244589 -2.428909 -0.708251
H  -5.78953 0.160958 2.620461
H  -6.543019 -1.933642 1.487613
H  1.190533 -0.758367 2.72652
H  5.728868 0.278921 -0.403291
H  3.291718 3.669873 -2.072462
H  2.653245 3.584738 -0.420662
H  2.009038 2.510425 -1.687027
H  4.931767 -2.30405 3.232343
H  6.082931 -3.273463 2.294449
H  4.355974 -3.326919 1.896101
H  0.874241 1.641648 0.23389
elementType: S O N C H
totalener: -2272.21586408 hartree
nucrepener: 3872.44959103 hartree
electener: -6144.66545511 hartree
twoeener: 4678.82319538 hartree
cpcmener: -0.06004463 hartree
kineticenergy: 2264.54151028 hartree
xcener: -174.187721473683 hartree
chargesum: -0.0000000
charge: 0.859415 0.892344 -0.549444 -0.546132 -0.505498 -0.501072 -0.489153 -0.296480 -0.298009 0.058369 -0.375616 -0.200432 -0.130044 -0.428060 -0.427773 -0.124364 0.059443 0.260842 -0.092413 0.012506 -0.224739 -0.259099 -0.186397 -0.077642 0.378540 0.361203 0.425761 0.422948 -0.322882 -0.110452 -0.115024 0.121409 0.130783 0.180399 0.156810 0.114716 0.101597 0.090814 0.168919 0.172855 0.194493 0.145484 0.139861 0.118976 0.099035 0.113461 0.131804 0.114389 0.233548
qa: 0.8594 0.8923 -0.5494 -0.5461 -0.5055 -0.5011 -0.4892 -0.2965 -0.2980 0.0584 -0.3756 -0.2004 -0.1300 -0.4281 -0.4278 -0.1244 0.0594 0.2608 -0.0924 0.0125 -0.2247 -0.2591 -0.1864 -0.0776 0.3785 0.3612 0.4258 0.4229 -0.3229 -0.1105 -0.1150 0.1214 0.1308 0.1804 0.1568 0.1147 0.1016 0.0908 0.1689 0.1729 0.1945 0.1455 0.1399 0.1190 0.0990 0.1135 0.1318 0.1144 0.2335
va: 5.5100 5.8604 1.9203 1.9366 1.9888 1.9936 2.0169 2.1305 2.1229 3.4963 3.0872 3.0826 3.1854 2.9562 2.9449 3.8145 3.9762 3.9281 3.8483 3.8695 3.9594 3.9394 3.9234 3.9051 4.3879 4.2372 3.9881 4.0110 3.9443 3.8373 3.8491 1.0307 1.0166 1.0111 1.0045 1.0019 1.0055 1.0143 0.9910 0.9837 1.0157 1.0165 0.9924 0.9930 1.0042 0.9953 0.9935 0.9953 1.0422
dispcorr: -0.031513757 hartree
energy: -2272.247377834443
dipole: 10.87677 -10.54204 0.33473 -15.10832 11.74212 -3.36620 4.08217 -1.44493 2.63723
magnitude: 4.28933 au
magnitude: 10.90261 debye
