program: Orca
programVersion: 5.0.2
elementType: S S O O O O O O O N N N N N N C C C C C C C C C C C C C C C C H H H H H H H H H H H H H H H H H H
charge: 0
multiplicity: 1
keywords: wb97x-d3
keywords: def2-TZVPP
keywords: def2/J RIJCOSX
keywords: DEFGRID2
keywords: scfconv7
keywords: smallprint printgap noloewdin
keywords: NOSOSCF
formula: C16H18N6O7S2
InChI: InChI=1S/C16H18N6O7S2/c1-4-30(24,25)13-14(22-8-6-5-7-10(22)17-13)31(26,27)21-16(23)20-15-18-11(28-2)9-12(19-15)29-3/h5-9,20-21H,4H2,1-3H3
49 atoms
S  -0.415335 -2.446514 0.295044
S  -1.055456 0.180037 -2.102651
O  -0.637388 -3.723386 -0.373036
O  0.7407 -1.641148 -0.088986
O  -1.833406 1.096477 -2.907672
O  -0.399423 -0.937685 -2.74799
O  -1.228652 2.237006 -0.034912
O  4.873602 1.542551 2.83678
O  4.328332 -0.361399 -1.358959
N  -3.376672 -0.003827 -0.563086
N  -2.934181 -1.710835 0.812411
N  0.162764 0.991525 -1.320047
N  0.933976 2.071412 0.592074
N  2.896833 1.815957 1.717089
N  2.638166 0.866177 -0.427143
C  -2.085257 -0.419068 -0.826746
C  -1.871692 -1.458498 0.056306
C  -3.850284 -0.823375 0.440956
C  -0.368882 -2.68451 2.063523
C  -4.134168 1.01966 -1.062534
C  -5.1469 -0.638549 0.943017
C  -0.107279 -1.394269 2.812599
C  -5.387024 1.205156 -0.577259
C  -5.909156 0.369179 0.433857
C  -0.114376 1.798459 -0.24608
C  2.21439 1.549913 0.619513
C  4.125401 1.318158 1.769929
C  3.862544 0.354456 -0.35077
C  4.678282 0.553833 0.749724
C  4.336592 2.298367 3.919691
C  3.499035 -0.576895 -2.500155
H  -1.302445 -3.1628 2.356153
H  0.437713 -3.408357 2.207646
H  -3.705708 1.641778 -1.827323
H  -5.498207 -1.295331 1.72557
H  -0.886585 -0.651757 2.644554
H  0.852966 -0.957259 2.544542
H  -0.087791 -1.613165 3.879095
H  -5.976491 2.015802 -0.978993
H  -6.910007 0.537587 0.805178
H  0.687078 2.644036 1.389784
H  5.675613 0.143283 0.810436
H  5.119292 2.325013 4.672908
H  3.450931 1.824829 4.342078
H  4.094848 3.317386 3.619618
H  3.220243 0.360912 -2.980103
H  2.600608 -1.13826 -2.243739
H  4.097821 -1.165547 -3.189603
H  1.115851 0.600188 -1.382254
elementType: S O N C H
totalener: -2272.21581848 hartree
nucrepener: 3877.48633489 hartree
electener: -6149.70215337 hartree
twoeener: 4683.93219020 hartree
cpcmener: -0.05919406 hartree
kineticenergy: 2264.54080965 hartree
xcener: -174.188026074528 hartree
chargesum: -0.0000000
charge: 0.856163 0.892170 -0.548632 -0.544304 -0.506023 -0.502046 -0.487746 -0.298740 -0.296575 0.059227 -0.375876 -0.199945 -0.129565 -0.427345 -0.423851 -0.131414 0.067852 0.259986 -0.089645 0.006017 -0.225376 -0.259401 -0.183487 -0.077148 0.375060 0.360147 0.425155 0.423482 -0.323086 -0.115869 -0.111326 0.121324 0.130955 0.184784 0.156423 0.100587 0.092005 0.114317 0.169017 0.172846 0.194206 0.145017 0.131545 0.113983 0.114151 0.118389 0.100503 0.139296 0.232791
qa: 0.8562 0.8922 -0.5486 -0.5443 -0.5060 -0.5020 -0.4877 -0.2987 -0.2966 0.0592 -0.3759 -0.1999 -0.1296 -0.4273 -0.4239 -0.1314 0.0679 0.2600 -0.0896 0.0060 -0.2254 -0.2594 -0.1835 -0.0771 0.3751 0.3601 0.4252 0.4235 -0.3231 -0.1159 -0.1113 0.1213 0.1310 0.1848 0.1564 0.1006 0.0920 0.1143 0.1690 0.1728 0.1942 0.1450 0.1315 0.1140 0.1142 0.1184 0.1005 0.1393 0.2328
va: 5.5152 5.8587 1.9217 1.9413 1.9881 1.9919 2.0171 2.1219 2.1303 3.5013 3.0822 3.0820 3.1835 2.9448 2.9594 3.8170 3.9627 3.9286 3.8463 3.8694 3.9587 3.9402 3.9159 3.9034 4.3904 4.2393 4.0057 3.9915 3.9422 3.8500 3.8346 1.0309 1.0165 1.0080 1.0046 1.0063 1.0139 1.0025 0.9909 0.9837 1.0157 1.0166 0.9937 0.9951 0.9950 0.9922 1.0059 0.9928 1.0457
dispcorr: -0.031738990 hartree
energy: -2272.247557466913
dipole: 7.30837 -7.95938 -0.65101 2.42671 -0.45503 1.97169 17.38294 -13.69701 3.68593
magnitude: 4.23054 au
magnitude: 10.75318 debye
