program: Orca
programVersion: 5.0.2
elementType: S S O O O O O O O N N N N N N C C C C C C C C C C C C C C C C H H H H H H H H H H H H H H H H H H
charge: 0
multiplicity: 1
keywords: wb97x-d3
keywords: def2-TZVPP
keywords: def2/J RIJCOSX
keywords: DEFGRID2
keywords: scfconv7
keywords: smallprint printgap noloewdin
keywords: NOSOSCF
formula: C16H18N6O7S2
InChI: InChI=1S/C16H18N6O7S2/c1-4-30(24,25)13-14(22-8-6-5-7-10(22)17-13)31(26,27)21-16(23)20-15-18-11(28-2)9-12(19-15)29-3/h5-9,20-21H,4H2,1-3H3
49 atoms
S  -0.725582 1.410092 1.992774
S  -1.248286 -1.776241 0.326247
O  0.507292 0.743707 1.581479
O  -0.747735 2.867548 2.005526
O  -1.975196 -2.823952 -0.356586
O  -0.856187 -1.967889 1.707141
O  -0.838872 -0.803948 -2.385673
O  4.095664 -1.271622 1.461853
O  5.538948 1.46078 -1.999087
N  -3.303355 -0.118543 -0.567529
N  -2.969536 1.771688 0.582889
N  0.171337 -1.467932 -0.469758
N  1.365908 -0.38206 -2.144764
N  2.726866 -0.861891 -0.32471
N  3.449765 0.532196 -2.08621
C  -2.17416 -0.302079 0.204936
C  -2.018742 0.89467 0.880757
C  -3.753365 1.158217 -0.297151
C  -1.244872 0.812475 3.594689
C  -3.929805 -0.915221 -1.486345
C  -4.900104 1.646143 -0.941868
C  -0.178274 1.107337 4.633759
C  -5.034228 -0.444553 -2.11658
C  -5.535571 0.847343 -1.844083
C  0.16895 -0.886594 -1.710364
C  2.566534 -0.235051 -1.475887
C  3.886903 -0.680038 0.298965
C  4.605822 0.696357 -1.456862
C  4.894305 0.105923 -0.23265
C  3.04182 -2.031591 2.052909
C  5.263011 2.128261 -3.228288
H  -2.187835 1.314024 3.81737
H  -1.434611 -0.2557 3.49946
H  -3.523583 -1.892607 -1.672985
H  -5.240735 2.644366 -0.707947
H  0.750373 0.581759 4.419276
H  -0.538881 0.761702 5.601073
H  0.028764 2.172636 4.71987
H  -5.522788 -1.08233 -2.838194
H  -6.419298 1.198578 -2.357665
H  1.319009 0.076252 -3.04629
H  5.836928 0.25554 0.27309
H  2.17968 -1.405851 2.283279
H  3.450081 -2.426137 2.979197
H  2.734001 -2.861622 1.417413
H  5.079433 1.423349 -4.038413
H  6.15527 2.705945 -3.453429
H  4.413527 2.804626 -3.137157
H  1.045365 -1.433005 0.077272
elementType: S O N C H
totalener: -2272.21698696 hartree
nucrepener: 3827.34410713 hartree
electener: -6099.56109409 hartree
twoeener: 4634.07780352 hartree
cpcmener: -0.05717261 hartree
kineticenergy: 2264.52883843 hartree
xcener: -174.185094403462 hartree
chargesum: -0.0000000
charge: 0.872170 0.891582 -0.551658 -0.551145 -0.502852 -0.506256 -0.494808 -0.296824 -0.299274 0.057573 -0.347398 -0.202787 -0.136483 -0.433910 -0.430067 -0.143925 0.068765 0.249174 -0.129534 0.008292 -0.222046 -0.260111 -0.181494 -0.078183 0.392359 0.372686 0.425156 0.425658 -0.324434 -0.108792 -0.115882 0.135962 0.139313 0.183249 0.155775 0.101137 0.106170 0.100536 0.169167 0.172813 0.193927 0.145079 0.098121 0.139623 0.118164 0.114019 0.131504 0.114662 0.235232
qa: 0.8722 0.8916 -0.5517 -0.5511 -0.5029 -0.5063 -0.4948 -0.2968 -0.2993 0.0576 -0.3474 -0.2028 -0.1365 -0.4339 -0.4301 -0.1439 0.0688 0.2492 -0.1295 0.0083 -0.2220 -0.2601 -0.1815 -0.0782 0.3924 0.3727 0.4252 0.4257 -0.3244 -0.1088 -0.1159 0.1360 0.1393 0.1832 0.1558 0.1011 0.1062 0.1005 0.1692 0.1728 0.1939 0.1451 0.0981 0.1396 0.1182 0.1140 0.1315 0.1147 0.2352
va: 5.4952 5.8529 1.9191 1.9309 1.9896 1.9861 2.0140 2.1316 2.1218 3.4987 3.1378 3.0814 3.1838 2.9570 2.9682 3.8766 4.0151 3.9406 3.8210 3.8646 3.9653 3.9458 3.9177 3.9038 4.3795 4.2494 3.9915 4.0105 3.9415 3.8402 3.8483 1.0165 1.0158 1.0094 1.0054 1.0067 1.0008 1.0106 0.9908 0.9837 1.0158 1.0166 0.9982 0.9933 0.9932 0.9949 0.9938 0.9954 1.0395
dispcorr: -0.030137590 hartree
energy: -2272.247124545545
dipole: 7.60917 -8.35289 -0.74373 4.14809 -4.47070 -0.32261 7.04144 -7.76418 -0.72274
magnitude: 1.08608 au
magnitude: 2.76059 debye
