program: Orca
programVersion: 5.0.2
elementType: S S O O O O O O O N N N N N N C C C C C C C C C C C C C C C C H H H H H H H H H H H H H H H H H H
charge: 0
multiplicity: 1
keywords: wb97x-d3
keywords: def2-TZVPP
keywords: def2/J RIJCOSX
keywords: DEFGRID2
keywords: scfconv7
keywords: smallprint printgap noloewdin
keywords: NOSOSCF
formula: C16H18N6O7S2
InChI: InChI=1S/C16H18N6O7S2/c1-4-30(24,25)13-14(22-8-6-5-7-10(22)17-13)31(26,27)21-16(23)20-15-18-11(28-2)9-12(19-15)29-3/h5-9,20-21H,4H2,1-3H3
49 atoms
S  -0.877142 -0.522533 -2.654115
S  -1.443556 1.803415 0.183918
O  -1.51034 -0.469595 -3.967096
O  0.15519 0.455836 -2.331277
O  -2.148867 2.412847 1.290839
O  -1.104329 2.618861 -0.95986
O  -0.993429 -0.186037 2.233744
O  4.014702 1.981017 -0.890315
O  5.585361 -1.654029 1.527898
N  -3.49653 -0.079742 0.268621
N  -3.121905 -1.348972 -1.532178
N  -0.005383 1.175096 0.716586
N  1.238293 -0.352827 1.957959
N  2.606726 0.839808 0.507288
N  3.40249 -1.007996 1.743593
C  -2.351282 0.401311 -0.339721
C  -2.172931 -0.422729 -1.43622
C  -3.924845 -1.145632 -0.496308
C  -0.228766 -2.165221 -2.382555
C  -4.15614 0.280057 1.413614
C  -5.07051 -1.864626 -0.122265
C  0.40309 -2.326918 -1.015967
C  -5.260861 -0.41467 1.781302
C  -5.733249 -1.499666 1.010021
C  0.016728 0.192786 1.671504
C  2.468965 -0.15642 1.363434
C  3.813801 1.000135 -0.027942
C  4.600668 -0.833844 1.202508
C  4.880396 0.177422 0.291707
C  2.923601 2.827814 -1.248627
C  5.327631 -2.725611 2.432643
H  -1.049612 -2.861791 -2.549671
H  0.499021 -2.303585 -3.18641
H  -3.77271 1.1073 1.982026
H  -5.386638 -2.692297 -0.74056
H  -0.304066 -2.137216 -0.208416
H  1.268813 -1.680208 -0.891677
H  0.742522 -3.356613 -0.913358
H  -5.770596 -0.120663 2.686783
H  -6.615342 -2.038419 1.325745
H  1.203565 -1.107807 2.631507
H  5.860565 0.309336 -0.142751
H  2.518854 3.354526 -0.38457
H  2.128645 2.269519 -1.741749
H  3.332687 3.552487 -1.947104
H  6.27139 -3.254182 2.535379
H  4.575609 -3.41019 2.041492
H  5.012931 -2.362477 3.410428
H  0.869889 1.420572 0.232194
elementType: S O N C H
totalener: -2272.21827324 hartree
nucrepener: 3849.18772394 hartree
electener: -6121.40599718 hartree
twoeener: 4654.68508882 hartree
cpcmener: -0.06347919 hartree
kineticenergy: 2264.51114407 hartree
xcener: -174.183527920142 hartree
chargesum: -0.0000000
charge: 0.872123 0.886244 -0.553009 -0.546015 -0.504379 -0.496314 -0.494959 -0.297225 -0.298276 0.061972 -0.376443 -0.194508 -0.125782 -0.430378 -0.428694 -0.100163 0.035187 0.262357 -0.097452 0.001452 -0.231541 -0.280195 -0.185248 -0.073480 0.373224 0.363621 0.422127 0.421927 -0.323091 -0.119077 -0.115118 0.126928 0.130056 0.189278 0.155984 0.109184 0.092156 0.119828 0.169006 0.172870 0.194714 0.145237 0.116656 0.108462 0.139726 0.131826 0.114363 0.113539 0.241304
qa: 0.8721 0.8862 -0.5530 -0.5460 -0.5044 -0.4963 -0.4950 -0.2972 -0.2983 0.0620 -0.3764 -0.1945 -0.1258 -0.4304 -0.4287 -0.1002 0.0352 0.2624 -0.0975 0.0015 -0.2315 -0.2802 -0.1852 -0.0735 0.3732 0.3636 0.4221 0.4219 -0.3231 -0.1191 -0.1151 0.1269 0.1301 0.1893 0.1560 0.1092 0.0922 0.1198 0.1690 0.1729 0.1947 0.1452 0.1167 0.1085 0.1397 0.1318 0.1144 0.1135 0.2413
va: 5.5168 5.8697 1.9244 1.9337 1.9930 1.9945 2.0074 2.1314 2.1224 3.5033 3.1065 3.0895 3.1817 2.9508 2.9493 3.8308 3.9981 3.9240 3.8336 3.8622 3.9657 3.9358 3.9150 3.8994 4.3807 4.2239 3.9938 4.0142 3.9388 3.8352 3.8486 1.0289 1.0174 1.0069 1.0050 1.0049 1.0173 1.0007 0.9911 0.9835 1.0160 1.0168 0.9931 1.0001 0.9933 0.9936 0.9954 0.9954 1.0276
dispcorr: -0.032060570 hartree
energy: -2272.250333811231
dipole: 12.39208 -11.59713 0.79495 -14.08177 10.70791 -3.37386 4.79667 -1.93730 2.85937
magnitude: 4.49342 au
magnitude: 11.42138 debye
