program: Orca
programVersion: 5.0.2
elementType: S S O O O O O O O N N N N N N C C C C C C C C C C C C C C C C H H H H H H H H H H H H H H H H H H
charge: 0
multiplicity: 1
keywords: wb97x-d3
keywords: def2-TZVPP
keywords: def2/J RIJCOSX
keywords: DEFGRID2
keywords: scfconv7
keywords: smallprint printgap noloewdin
keywords: NOSOSCF
formula: C16H18N6O7S2
InChI: InChI=1S/C16H18N6O7S2/c1-4-30(24,25)13-14(22-8-6-5-7-10(22)17-13)31(26,27)21-16(23)20-15-18-11(28-2)9-12(19-15)29-3/h5-9,20-21H,4H2,1-3H3
49 atoms
S  -0.971952 -1.227419 2.310373
S  -1.432544 1.785372 0.219639
O  0.06354 -0.200744 2.296798
O  -1.655461 -1.523996 3.563976
O  -1.164603 2.267769 1.55544
O  -2.071825 2.671581 -0.728711
O  -0.872065 0.382048 -2.241035
O  3.950847 1.646266 1.576168
O  5.667963 -1.271908 -1.598886
N  -3.51189 0.044362 -0.426025
N  -3.19034 -1.690276 0.946034
N  0.033265 1.299981 -0.379643
N  1.348519 0.153847 -1.922921
N  2.634899 0.924735 -0.149454
N  3.502441 -0.557183 -1.769237
C  -2.369033 0.309112 0.305714
C  -2.225165 -0.793855 1.126015
C  -3.97315 -1.184053 0.003022
C  -0.300053 -2.739386 1.638416
C  -4.148299 0.729986 -1.42553
C  -5.131469 -1.73686 -0.563987
C  0.375748 -2.536622 0.299151
C  -5.264261 0.196715 -1.980595
C  -5.772493 -1.048443 -1.548513
C  0.108808 0.602755 -1.55633
C  2.54659 0.179768 -1.236199
C  3.805391 0.920411 0.481488
C  4.663793 -0.550798 -1.12906
C  4.886293 0.182477 0.030013
C  2.854118 2.436532 2.033766
C  5.472116 -2.0480 -2.779268
H  0.404602 -3.080802 2.401533
H  -1.11826 -3.457419 1.591649
H  -3.738009 1.674314 -1.733006
H  -5.476203 -2.695317 -0.203929
H  1.230434 -1.868259 0.376067
H  -0.311579 -2.155949 -0.456171
H  0.741395 -3.500614 -0.051245
H  -5.757402 0.748237 -2.767099
H  -6.665752 -1.451166 -2.004296
H  1.350519 -0.40084 -2.770169
H  5.836976 0.178933 0.542687
H  2.540208 3.162801 1.28419
H  3.219503 2.964808 2.909977
H  2.00507 1.817217 2.321839
H  5.235606 -1.422057 -3.639094
H  4.687798 -2.792616 -2.646916
H  6.417217 -2.55405 -2.955954
H  0.883014 1.412673 0.191148
elementType: S O N C H
totalener: -2272.21824662 hartree
nucrepener: 3851.52887049 hartree
electener: -6123.74711710 hartree
twoeener: 4657.10013831 hartree
cpcmener: -0.06337904 hartree
kineticenergy: 2264.53266395 hartree
xcener: -174.188032624025 hartree
chargesum: -0.0000000
charge: 0.872876 0.887276 -0.546513 -0.552437 -0.497269 -0.505020 -0.493070 -0.297286 -0.299184 0.059845 -0.375534 -0.192304 -0.127780 -0.429827 -0.427439 -0.097470 0.033380 0.261196 -0.101536 -0.000562 -0.231879 -0.275876 -0.184638 -0.071903 0.370139 0.358912 0.423556 0.423886 -0.320760 -0.119629 -0.116140 0.130748 0.128118 0.191391 0.155707 0.089795 0.108352 0.120695 0.168395 0.172112 0.195093 0.144733 0.118224 0.140249 0.106749 0.114331 0.114335 0.131916 0.242047
qa: 0.8729 0.8873 -0.5465 -0.5524 -0.4973 -0.5050 -0.4931 -0.2973 -0.2992 0.0598 -0.3755 -0.1923 -0.1278 -0.4298 -0.4274 -0.0975 0.0334 0.2612 -0.1015 -0.0006 -0.2319 -0.2759 -0.1846 -0.0719 0.3701 0.3589 0.4236 0.4239 -0.3208 -0.1196 -0.1161 0.1307 0.1281 0.1914 0.1557 0.0898 0.1084 0.1207 0.1684 0.1721 0.1951 0.1447 0.1182 0.1402 0.1067 0.1143 0.1143 0.1319 0.2420
va: 5.5213 5.8679 1.9322 1.9271 1.9916 1.9935 2.0078 2.1316 2.1217 3.5055 3.1098 3.0929 3.1791 2.9503 2.9482 3.8272 3.9990 3.9246 3.8387 3.8626 3.9638 3.9344 3.9104 3.8973 4.3861 4.2287 3.9912 4.0099 3.9410 3.8373 3.8488 1.0173 1.0278 1.0051 1.0052 1.0185 1.0053 1.0004 0.9913 0.9839 1.0154 1.0169 0.9934 0.9930 0.9987 0.9953 0.9953 0.9935 1.0263
dispcorr: -0.032077645 hartree
energy: -2272.250324260670
dipole: 12.53279 -11.63821 0.89458 -12.01713 9.64785 -2.36928 -7.76818 4.23391 -3.53427
magnitude: 4.34796 au
magnitude: 11.05165 debye
