program: Orca
programVersion: 5.0.2
elementType: S S O O O O O O O N N N N N N C C C C C C C C C C C C C C C C H H H H H H H H H H H H H H H H H H
charge: 0
multiplicity: 1
keywords: wb97x-d3
keywords: def2-TZVPP
keywords: def2/J RIJCOSX
keywords: DEFGRID2
keywords: scfconv7
keywords: smallprint printgap noloewdin
keywords: NOSOSCF
formula: C16H18N6O7S2
InChI: InChI=1S/C16H18N6O7S2/c1-4-30(24,25)13-14(22-8-6-5-7-10(22)17-13)31(26,27)21-16(23)20-15-18-11(28-2)9-12(19-15)29-3/h5-9,20-21H,4H2,1-3H3
49 atoms
S  -0.883433 1.013639 2.368108
S  -1.057393 -1.761434 0.013036
O  0.411976 0.56673 1.862857
O  -1.061633 2.425877 2.68191
O  -1.663597 -2.695862 -0.909816
O  -0.637809 -2.226476 1.318353
O  -0.734832 -0.177479 -2.423098
O  4.259292 -1.237095 1.221815
O  5.773595 1.739981 -2.000291
N  -3.272694 -0.161188 -0.541454
N  -3.124466 1.467564 0.98546
N  0.316271 -1.126556 -0.65337
N  1.459004 0.262251 -2.119857
N  2.845283 -0.502645 -0.418968
N  3.609596 1.00203 -2.067959
C  -2.14182 -0.40729 0.212547
C  -2.106496 0.628145 1.130352
C  -3.836447 0.989805 -0.028521
C  -1.330185 0.034855 3.793121
C  -3.823626 -0.802344 -1.617263
C  -5.011598 1.507762 -0.592719
C  -2.678022 0.405217 4.373612
C  -4.958095 -0.303306 -2.16756
C  -5.56893 0.862102 -1.654604
C  0.27954 -0.342723 -1.773407
C  2.691604 0.245718 -1.496577
C  4.048644 -0.498272 0.14681
C  4.802698 1.001266 -1.48876
C  5.09641 0.254159 -0.354651
C  3.187327 -2.021643 1.745188
C  5.503886 2.53934 -3.149802
H  -1.282585 -1.008071 3.482647
H  -0.518058 0.21374 4.503186
H  -3.337451 -1.68766 -1.984622
H  -5.436239 2.406461 -0.1692
H  -2.847642 -0.20643 5.258329
H  -3.49356 0.207732 3.679761
H  -2.717093 1.448424 4.679711
H  -5.386109 -0.819829 -3.013774
H  -6.473226 1.239021 -2.110884
H  1.403499 0.840731 -2.948863
H  6.073489 0.261392 0.105638
H  2.373167 -1.394492 2.106913
H  3.609109 -2.571374 2.58202
H  2.807236 -2.729841 1.008934
H  6.432477 3.059378 -3.36847
H  4.721677 3.27279 -2.956193
H  5.224423 1.930129 -4.008671
H  1.19259 -1.153896 -0.108303
elementType: S O N C H
totalener: -2272.21824621 hartree
nucrepener: 3804.81407285 hartree
electener: -6077.03231906 hartree
twoeener: 4611.52026261 hartree
cpcmener: -0.05824420 hartree
kineticenergy: 2264.53113635 hartree
xcener: -174.186989735209 hartree
chargesum: -0.0000000
charge: 0.877305 0.883808 -0.557136 -0.551388 -0.502562 -0.507311 -0.499192 -0.297387 -0.299432 0.057161 -0.351730 -0.196256 -0.132741 -0.433045 -0.434130 -0.123997 0.050604 0.255053 -0.108329 0.002741 -0.224175 -0.264792 -0.179912 -0.076629 0.394545 0.378302 0.422479 0.425086 -0.323431 -0.118340 -0.115811 0.135198 0.127731 0.185815 0.155573 0.107918 0.100332 0.100590 0.168578 0.172352 0.192636 0.145260 0.108357 0.139649 0.115366 0.131779 0.114473 0.113910 0.235124
qa: 0.8773 0.8838 -0.5571 -0.5514 -0.5026 -0.5073 -0.4992 -0.2974 -0.2994 0.0572 -0.3517 -0.1963 -0.1327 -0.4330 -0.4341 -0.1240 0.0506 0.2551 -0.1083 0.0027 -0.2242 -0.2648 -0.1799 -0.0766 0.3945 0.3783 0.4225 0.4251 -0.3234 -0.1183 -0.1158 0.1352 0.1277 0.1858 0.1556 0.1079 0.1003 0.1006 0.1686 0.1724 0.1926 0.1453 0.1084 0.1396 0.1154 0.1318 0.1145 0.1139 0.2351
va: 5.5110 5.8572 1.9285 1.9284 1.9897 1.9838 2.0117 2.1329 2.1216 3.5045 3.1148 3.0838 3.1838 2.9656 2.9680 3.8658 3.9960 3.9290 3.8317 3.8647 3.9616 3.9574 3.9137 3.9023 4.3794 4.2451 3.9929 4.0121 3.9364 3.8376 3.8484 1.0212 1.0155 1.0075 1.0055 1.0003 1.0032 1.0126 0.9909 0.9839 1.0167 1.0166 1.0009 0.9934 0.9931 0.9936 0.9953 0.9953 1.0380
dispcorr: -0.029931948 hartree
energy: -2272.248178154100
dipole: 2.46338 -3.22821 -0.76483 2.52843 -2.94768 -0.41925 5.94196 -6.89529 -0.95333
magnitude: 1.29212 au
magnitude: 3.28431 debye
