program: Orca
programVersion: 5.0.2
elementType: S S O O O O O O O N N N N N N C C C C C C C C C C C C C C C C H H H H H H H H H H H H H H H H H H
charge: 0
multiplicity: 1
keywords: wb97x-d3
keywords: def2-TZVPP
keywords: def2/J RIJCOSX
keywords: DEFGRID2
keywords: scfconv7
keywords: smallprint printgap noloewdin
keywords: NOSOSCF
formula: C16H18N6O7S2
InChI: InChI=1S/C16H18N6O7S2/c1-4-30(24,25)13-14(22-8-6-5-7-10(22)17-13)31(26,27)21-16(23)20-15-18-11(28-2)9-12(19-15)29-3/h5-9,20-21H,4H2,1-3H3
49 atoms
S  -0.946192 -1.152423 2.317706
S  -1.371686 1.809135 0.217537
O  0.24813 -0.370337 2.018006
O  -1.562096 -1.042719 3.633182
O  -1.064175 2.230216 1.564908
O  -2.026003 2.728839 -0.686266
O  -0.847834 0.396256 -2.26531
O  3.963181 1.644445 1.563752
O  5.780071 -0.99082 -1.799337
N  -3.447824 0.073916 -0.470058
N  -3.152001 -1.652863 0.915961
N  0.077597 1.335943 -0.424322
N  1.37225 0.144246 -1.939386
N  2.652457 0.912671 -0.157957
N  3.573446 -0.416134 -1.874104
C  -2.319492 0.341218 0.28062
C  -2.188012 -0.757903 1.106436
C  -3.918695 -1.15152 -0.04258
C  -0.605906 -2.872365 1.971228
C  -4.064309 0.759285 -1.480161
C  -5.065974 -1.70598 -0.631984
C  0.033925 -3.081385 0.614486
C  -5.169686 0.225058 -2.056199
C  -5.685765 -1.019619 -1.631827
C  0.135085 0.619961 -1.588801
C  2.583529 0.225406 -1.28384
C  3.838234 0.963958 0.441426
C  4.749165 -0.363149 -1.264202
C  4.955287 0.327753 -0.075756
C  2.823492 2.311375 2.104494
C  5.589942 -1.722368 -3.006919
H  0.058212 -3.17724 2.784925
H  -1.543915 -3.415412 2.084852
H  -3.645032 1.703056 -1.779458
H  -5.417609 -2.66375 -0.275603
H  0.99409 -2.573716 0.534716
H  -0.606076 -2.746165 -0.201702
H  0.207089 -4.147914 0.473568
H  -5.647907 0.774936 -2.853454
H  -6.569316 -1.423868 -2.105861
H  1.385892 -0.386337 -2.801676
H  5.918482 0.365857 0.412211
H  2.414144 3.044235 1.408193
H  3.18103 2.82763 2.991814
H  2.046522 1.60498 2.395565
H  5.283919 -1.074282 -3.828588
H  4.856165 -2.519506 -2.885281
H  6.557372 -2.160559 -3.239052
H  0.930904 1.415049 0.148267
elementType: S O N C H
totalener: -2272.21820507 hartree
nucrepener: 3839.27133136 hartree
electener: -6111.48953643 hartree
twoeener: 4645.33118703 hartree
cpcmener: -0.04935881 hartree
kineticenergy: 2264.55969691 hartree
xcener: -174.190317154173 hartree
chargesum: -0.0000000
charge: 0.857120 0.875418 -0.537583 -0.531023 -0.486852 -0.496708 -0.472038 -0.288065 -0.290581 0.058439 -0.373542 -0.192438 -0.131719 -0.430489 -0.434139 -0.107783 0.043724 0.255848 -0.101686 0.002613 -0.227912 -0.265067 -0.181334 -0.074932 0.367213 0.372426 0.418474 0.418034 -0.324238 -0.122175 -0.116189 0.128679 0.122232 0.185595 0.153377 0.095058 0.099681 0.112981 0.164640 0.168253 0.190049 0.143036 0.113982 0.137863 0.111128 0.112807 0.112366 0.130621 0.234838
qa: 0.8571 0.8754 -0.5376 -0.5310 -0.4869 -0.4967 -0.4720 -0.2881 -0.2906 0.0584 -0.3735 -0.1924 -0.1317 -0.4305 -0.4341 -0.1078 0.0437 0.2558 -0.1017 0.0026 -0.2279 -0.2651 -0.1813 -0.0749 0.3672 0.3724 0.4185 0.4180 -0.3242 -0.1222 -0.1162 0.1287 0.1222 0.1856 0.1534 0.0951 0.0997 0.1130 0.1646 0.1683 0.1900 0.1430 0.1140 0.1379 0.1111 0.1128 0.1124 0.1306 0.2348
va: 5.5302 5.8870 1.9518 1.9457 2.0096 2.0015 2.0405 2.1430 2.1314 3.5063 3.0834 3.0922 3.1728 2.9596 2.9588 3.8153 3.9697 3.9339 3.8416 3.8701 3.9624 3.9384 3.9102 3.9015 4.3978 4.2360 4.0046 4.0223 3.9325 3.8336 3.8528 1.0174 1.0314 1.0089 1.0059 1.0134 1.0065 1.0016 0.9926 0.9854 1.0187 1.0173 0.9932 0.9934 1.0062 0.9956 0.9959 0.9937 1.0359
dispcorr: -0.030813282 hartree
energy: -2272.249018349273
dipole: 10.93354 -10.43563 0.49791 -13.69614 11.16889 -2.52725 -6.53695 3.47438 -3.06257
magnitude: 4.00178 au
magnitude: 10.17171 debye
