program: Orca
programVersion: 5.0.2
elementType: S S O O O O O O O N N N N N N C C C C C C C C C C C C C C C C H H H H H H H H H H H H H H H H H H
charge: 0
multiplicity: 1
keywords: wb97x-d3
keywords: def2-TZVPP
keywords: def2/J RIJCOSX
keywords: DEFGRID2
keywords: scfconv7
keywords: smallprint printgap noloewdin
keywords: NOSOSCF
formula: C16H18N6O7S2
InChI: InChI=1S/C16H18N6O7S2/c1-4-30(24,25)13-14(22-8-6-5-7-10(22)17-13)31(26,27)21-16(23)20-15-18-11(28-2)9-12(19-15)29-3/h5-9,20-21H,4H2,1-3H3
49 atoms
S  -0.88986 -1.187059 2.246543
S  -1.366247 1.805491 0.201797
O  0.302397 -0.412783 1.918171
O  -1.465496 -1.081283 3.580433
O  -1.051819 2.212453 1.552402
O  -2.039227 2.729732 -0.683969
O  -0.827548 0.402413 -2.294046
O  3.932778 1.711631 1.569711
O  5.787324 -1.010204 -1.703148
N  -3.455942 0.080708 -0.462375
N  -3.141535 -1.655722 0.90734
N  0.083206 1.358055 -0.453348
N  1.394231 0.169095 -1.952859
N  2.652999 0.96537 -0.16856
N  3.5894 -0.413754 -1.834853
C  -2.302799 0.330509 0.256158
C  -2.162089 -0.772928 1.074283
C  -3.930685 -1.13973 -0.025075
C  -0.579227 -2.907584 1.875975
C  -4.092586 0.777748 -1.451824
C  -5.106485 -1.673043 -0.576976
C  0.001745 -3.116661 0.493105
C  -5.226598 0.264874 -1.990492
C  -5.75019 -0.971274 -1.550681
C  0.150231 0.637877 -1.614269
C  2.596406 0.25372 -1.27994
C  3.825323 1.012198 0.456918
C  4.753489 -0.359763 -1.202814
C  4.944541 0.352947 -0.024518
C  2.786488 2.396602 2.072661
C  5.612837 -1.76505 -2.898416
H  0.114196 -3.225396 2.659617
H  -1.517526 -3.441715 2.023436
H  -3.665744 1.71332 -1.765763
H  -5.46136 -2.626441 -0.212253
H  -0.662108 -2.761606 -0.295104
H  0.150208 -4.184488 0.336593
H  0.967874 -2.628413 0.381803
H  -5.720964 0.824709 -2.77078
H  -6.657306 -1.357989 -1.9938
H  1.417613 -0.372513 -2.808076
H  5.898279 0.389685 0.481618
H  2.398958 3.119614 1.354224
H  3.127217 2.925665 2.958961
H  1.997471 1.701062 2.358114
H  5.327338 -1.131927 -3.738899
H  4.869887 -2.553118 -2.774055
H  6.580284 -2.216135 -3.1037
H  0.939401 1.449862 0.115134
elementType: S O N C H
totalener: -2272.21806230 hartree
nucrepener: 3842.03508590 hartree
electener: -6114.25314820 hartree
twoeener: 4648.14923219 hartree
cpcmener: -0.04934477 hartree
kineticenergy: 2264.56191972 hartree
xcener: -174.190903840014 hartree
chargesum: -0.0000000
charge: 0.856274 0.876055 -0.537544 -0.531222 -0.488011 -0.497553 -0.469615 -0.288089 -0.290396 0.057682 -0.373287 -0.191585 -0.132286 -0.427546 -0.433615 -0.106947 0.042308 0.255762 -0.100423 0.004731 -0.227768 -0.264834 -0.183576 -0.074449 0.363962 0.370182 0.419663 0.418184 -0.323839 -0.119814 -0.116161 0.128616 0.121893 0.185313 0.153587 0.099777 0.112943 0.095192 0.164664 0.168269 0.190059 0.143213 0.114146 0.137951 0.108788 0.112780 0.112370 0.130578 0.233620
qa: 0.8563 0.8761 -0.5375 -0.5312 -0.4880 -0.4976 -0.4696 -0.2881 -0.2904 0.0577 -0.3733 -0.1916 -0.1323 -0.4275 -0.4336 -0.1069 0.0423 0.2558 -0.1004 0.0047 -0.2278 -0.2648 -0.1836 -0.0744 0.3640 0.3702 0.4197 0.4182 -0.3238 -0.1198 -0.1162 0.1286 0.1219 0.1853 0.1536 0.0998 0.1129 0.0952 0.1647 0.1683 0.1901 0.1432 0.1141 0.1380 0.1088 0.1128 0.1124 0.1306 0.2336
va: 5.5306 5.8873 1.9515 1.9457 2.0083 2.0001 2.0432 2.1431 2.1317 3.5058 3.0834 3.0894 3.1737 2.9622 2.9570 3.8134 3.9707 3.9339 3.8414 3.8712 3.9622 3.9391 3.9126 3.9009 4.4032 4.2383 4.0022 4.0222 3.9338 3.8348 3.8528 1.0175 1.0314 1.0090 1.0058 1.0066 1.0018 1.0129 0.9926 0.9854 1.0186 1.0172 0.9930 0.9935 1.0064 0.9957 0.9959 0.9937 1.0399
dispcorr: -0.030880170 hartree
energy: -2272.248942473580
dipole: 10.55747 -10.14439 0.41308 -13.61484 11.14128 -2.47356 -6.49545 3.48097 -3.01449
magnitude: 3.92126 au
magnitude: 9.96705 debye
