program: Orca
programVersion: 5.0.2
elementType: S S O O O O O O O N N N N N N C C C C C C C C C C C C C C C C H H H H H H H H H H H H H H H H H H
charge: 0
multiplicity: 1
keywords: wb97x-d3
keywords: def2-TZVPP
keywords: def2/J RIJCOSX
keywords: DEFGRID2
keywords: scfconv7
keywords: smallprint printgap noloewdin
keywords: NOSOSCF
formula: C16H18N6O7S2
InChI: InChI=1S/C16H18N6O7S2/c1-4-30(24,25)13-14(22-8-6-5-7-10(22)17-13)31(26,27)21-16(23)20-15-18-11(28-2)9-12(19-15)29-3/h5-9,20-21H,4H2,1-3H3
49 atoms
S  -0.559327 -2.173185 1.423722
S  -1.281505 1.367781 0.970618
O  -0.508584 -3.531743 0.905388
O  0.622867 -1.327941 1.30373
O  -0.854363 1.100984 2.326834
O  -2.073963 2.542999 0.685698
O  -0.903651 1.468653 -1.917779
O  5.746013 0.261591 -2.526847
O  4.139541 0.906519 1.778922
N  -3.269164 0.009379 -0.436868
N  -2.788304 -2.140721 -0.052142
N  0.124988 1.409567 0.099444
N  1.339063 1.210557 -1.869837
N  3.539121 0.744817 -2.2008
N  2.724889 1.058489 -0.009796
C  -2.146151 -0.022871 0.364865
C  -1.89748 -1.369732 0.560058
C  -3.624237 -1.306828 -0.657458
C  -1.084091 -2.220286 3.130481
C  -3.97966 1.039465 -0.988093
C  -4.7475 -1.606803 -1.445137
C  -2.32551 -3.059764 3.345346
C  -5.065117 0.753902 -1.749472
C  -5.462255 -0.580997 -1.98532
C  0.117927 1.377043 -1.269036
C  2.58764 0.996178 -1.322225
C  4.749282 0.530153 -1.703854
C  3.944676 0.847498 0.475828
C  5.027505 0.570587 -0.342418
C  5.48266 0.178701 -3.924436
C  3.034652 1.187671 2.636124
H  -0.221322 -2.628526 3.664572
H  -1.217471 -1.186934 3.450013
H  -3.651435 2.043901 -0.790514
H  -5.006003 -2.644693 -1.600132
H  -3.195989 -2.648563 2.835859
H  -2.549611 -3.077125 4.411201
H  -2.181626 -4.088543 3.020287
H  -5.620884 1.575693 -2.17666
H  -6.330861 -0.781754 -2.596826
H  1.304497 1.166523 -2.880705
H  6.018304 0.394892 0.050929
H  6.435873 -0.061318 -4.388572
H  5.117345 1.124468 -4.325034
H  4.765163 -0.609546 -4.153734
H  3.447307 1.226194 3.641066
H  2.282679 0.399997 2.592363
H  2.575369 2.149129 2.404217
H  1.01813 1.245097 0.587941
elementType: S O N C H
totalener: -2272.21896091 hartree
nucrepener: 3812.96845847 hartree
electener: -6085.18741938 hartree
twoeener: 4619.45589972 hartree
cpcmener: -0.04802586 hartree
kineticenergy: 2264.55501357 hartree
xcener: -174.188566261377 hartree
chargesum: 0.0000000
charge: 0.868211 0.879996 -0.533341 -0.544741 -0.497918 -0.493811 -0.475572 -0.290570 -0.288703 0.056469 -0.345972 -0.199729 -0.137431 -0.433096 -0.432499 -0.127993 0.046050 0.251472 -0.112860 0.005076 -0.223607 -0.263206 -0.179399 -0.078595 0.382702 0.375977 0.419077 0.420189 -0.325295 -0.116618 -0.120196 0.124032 0.132113 0.182074 0.153878 0.098051 0.105537 0.101892 0.165238 0.168780 0.189852 0.143258 0.130509 0.112308 0.113342 0.137527 0.108835 0.114518 0.234190
qa: 0.8682 0.8800 -0.5333 -0.5447 -0.4979 -0.4938 -0.4756 -0.2906 -0.2887 0.0565 -0.3460 -0.1997 -0.1374 -0.4331 -0.4325 -0.1280 0.0460 0.2515 -0.1129 0.0051 -0.2236 -0.2632 -0.1794 -0.0786 0.3827 0.3760 0.4191 0.4202 -0.3253 -0.1166 -0.1202 0.1240 0.1321 0.1821 0.1539 0.0981 0.1055 0.1019 0.1652 0.1688 0.1899 0.1433 0.1305 0.1123 0.1133 0.1375 0.1088 0.1145 0.2342
va: 5.5340 5.8690 1.9523 1.9442 1.9966 2.0006 2.0398 2.1318 2.1419 3.5048 3.1160 3.0808 3.1782 2.9659 2.9630 3.8666 3.9930 3.9359 3.8363 3.8684 3.9640 3.9561 3.9117 3.9028 4.3918 4.2477 4.0220 4.0006 3.9342 3.8525 3.8407 1.0164 1.0224 1.0112 1.0061 1.0040 1.0002 1.0128 0.9921 0.9852 1.0188 1.0172 0.9938 0.9954 0.9956 0.9937 1.0014 0.9931 1.0372
dispcorr: -0.030052090 hartree
energy: -2272.249013000153
dipole: 2.90914 -3.73480 -0.82566 -5.59880 6.19853 0.59974 3.44882 -4.06453 -0.61572
magnitude: 1.19185 au
magnitude: 3.02944 debye
