program: Orca
programVersion: 5.0.2
elementType: S S O O O O O O O N N N N N N C C C C C C C C C C C C C C C C H H H H H H H H H H H H H H H H H H
charge: 0
multiplicity: 1
keywords: wb97x-d3
keywords: def2-TZVPP
keywords: def2/J RIJCOSX
keywords: DEFGRID2
keywords: scfconv7
keywords: smallprint printgap noloewdin
keywords: NOSOSCF
formula: C16H18N6O7S2
InChI: InChI=1S/C16H18N6O7S2/c1-4-30(24,25)13-14(22-8-6-5-7-10(22)17-13)31(26,27)21-16(23)20-15-18-11(28-2)9-12(19-15)29-3/h5-9,20-21H,4H2,1-3H3
49 atoms
S  -0.575451 -1.719505 1.875804
S  -1.265442 1.629341 0.593549
O  -0.517361 -3.159353 1.667088
O  0.603485 -0.913147 1.580195
O  -0.853812 1.696158 1.978839
O  -2.039311 2.711399 0.02649
O  -0.859709 0.951203 -2.218498
O  5.731297 -0.656906 -2.266529
O  4.098183 1.312482 1.606034
N  -3.262364 -0.012928 -0.454656
N  -2.804942 -2.01244 0.435981
N  0.146309 1.452137 -0.250685
N  1.377463 0.676799 -2.058692
N  3.554114 0.024029 -2.171607
N  2.728515 1.014346 -0.197872
C  -2.141403 0.13841 0.336357
C  -1.907205 -1.12646 0.849114
C  -3.630715 -1.340086 -0.355001
C  -1.115803 -1.396202 3.547926
C  -3.955128 0.858629 -1.24839
C  -4.751954 -1.811446 -1.056351
C  -2.333917 -2.20605 3.940726
C  -5.037493 0.406758 -1.929314
C  -5.450691 -0.940982 -1.83653
C  0.151966 1.029164 -1.552599
C  2.605879 0.572978 -1.437212
C  4.74107 -0.099818 -1.593534
C  3.924074 0.887979 0.36966
C  5.000841 0.325342 -0.295918
C  5.483214 -1.138337 -3.584943
C  2.99611 1.889436 2.30482
H  -0.247905 -1.64432 4.165335
H  -1.28369 -0.3217 3.622943
H  -3.614573 1.877128 -1.299349
H  -5.020374 -2.853687 -0.957047
H  -2.57373 -1.986842 4.980566
H  -2.151426 -3.27621 3.861832
H  -3.208815 -1.953725 3.343108
H  -5.57869 1.105024 -2.550839
H  -6.317511 -1.275632 -2.389246
H  1.353753 0.341822 -3.013862
H  5.972521 0.218602 0.164292
H  4.713928 -1.911063 -3.593943
H  6.423661 -1.56726 -3.922118
H  5.193053 -0.3341 -4.26168
H  2.607761 2.770313 1.792288
H  3.388394 2.18764 3.273662
H  2.193443 1.167416 2.455328
H  1.03288 1.403098 0.276529
elementType: S O N C H
totalener: -2272.21820894 hartree
nucrepener: 3821.04315476 hartree
electener: -6093.26136370 hartree
twoeener: 4627.59184573 hartree
cpcmener: -0.04782606 hartree
kineticenergy: 2264.54230519 hartree
xcener: -174.185659730297 hartree
chargesum: -0.0000000
charge: 0.867375 0.882506 -0.533155 -0.544211 -0.497097 -0.495595 -0.473239 -0.290659 -0.288263 0.055138 -0.347945 -0.200560 -0.139367 -0.431893 -0.429708 -0.136762 0.053957 0.250643 -0.108311 0.004861 -0.221362 -0.263815 -0.178154 -0.079502 0.379480 0.373191 0.419635 0.421029 -0.324915 -0.115741 -0.118227 0.123745 0.130148 0.182830 0.154011 0.105038 0.101078 0.098924 0.164667 0.169030 0.190004 0.142719 0.112873 0.130357 0.112478 0.115430 0.137691 0.106181 0.233465
qa: 0.8674 0.8825 -0.5332 -0.5442 -0.4971 -0.4956 -0.4732 -0.2907 -0.2883 0.0551 -0.3479 -0.2006 -0.1394 -0.4319 -0.4297 -0.1368 0.0540 0.2506 -0.1083 0.0049 -0.2214 -0.2638 -0.1782 -0.0795 0.3795 0.3732 0.4196 0.4210 -0.3249 -0.1157 -0.1182 0.1237 0.1301 0.1828 0.1540 0.1050 0.1011 0.0989 0.1647 0.1690 0.1900 0.1427 0.1129 0.1304 0.1125 0.1154 0.1377 0.1062 0.2335
va: 5.5334 5.8664 1.9510 1.9482 1.9974 1.9989 2.0414 2.1321 2.1422 3.5072 3.1141 3.0762 3.1782 2.9663 2.9628 3.8695 3.9838 3.9366 3.8355 3.8682 3.9646 3.9564 3.9105 3.9038 4.3955 4.2515 4.0218 3.9985 3.9367 3.8524 3.8421 1.0162 1.0230 1.0104 1.0062 1.0004 1.0130 1.0047 0.9923 0.9852 1.0186 1.0173 0.9959 0.9937 0.9954 0.9927 0.9937 1.0012 1.0410
dispcorr: -0.030213861 hartree
energy: -2272.248422801596
dipole: 2.79606 -3.61513 -0.81908 -5.30332 5.62625 0.32293 4.98388 -5.65778 -0.67390
magnitude: 1.10874 au
magnitude: 2.81820 debye
