program: Orca
programVersion: 5.0.2
elementType: S S O O O O O O O N N N N N N C C C C C C C C C C C C C C C C H H H H H H H H H H H H H H H H H H
charge: 0
multiplicity: 1
keywords: wb97x-d3
keywords: def2-TZVPP
keywords: def2/J RIJCOSX
keywords: DEFGRID2
keywords: scfconv7
keywords: smallprint printgap noloewdin
keywords: NOSOSCF
formula: C16H18N6O7S2
InChI: InChI=1S/C16H18N6O7S2/c1-4-30(24,25)13-14(22-8-6-5-7-10(22)17-13)31(26,27)21-16(23)20-15-18-11(28-2)9-12(19-15)29-3/h5-9,20-21H,4H2,1-3H3
49 atoms
S  -0.646682 -0.555972 -2.445991
S  -1.378361 1.91523 0.027598
O  -1.037107 0.196829 -3.618779
O  0.569311 -0.224642 -1.71208
O  -2.203421 2.699001 0.913381
O  -0.934388 2.429327 -1.243113
O  -0.964316 0.306871 2.477352
O  3.909998 1.686865 -1.221933
O  5.54255 -1.427388 1.810405
N  -3.294649 -0.082801 0.426416
N  -2.849607 -1.53557 -1.213743
N  0.029251 1.469443 0.793807
N  1.26743 0.098466 2.199512
N  2.590365 0.944897 0.487164
N  3.404648 -0.656215 2.016893
C  -2.203505 0.400366 -0.262142
C  -1.972767 -0.533853 -1.250327
C  -3.653201 -1.263552 -0.195639
C  -0.570565 -2.294434 -2.889802
C  -3.954946 0.379196 1.528715
C  -4.74384 -2.000518 0.294786
C  -0.038255 -3.182634 -1.784335
C  -5.007225 -0.331895 2.004938
C  -5.414684 -1.534765 1.384739
C  0.029543 0.615088 1.863013
C  2.472279 0.14177 1.527842
C  3.750211 0.924102 -0.1621
C  4.564558 -0.650826 1.375108
C  4.80784 0.126825 0.25018
C  2.813536 2.474388 -1.680541
C  5.307858 -2.23662 2.950512
H  -1.567369 -2.585023 -3.218627
H  0.085688 -2.293466 -3.763714
H  -3.597253 1.291256 1.972635
H  -5.009928 -2.917813 -0.209177
H  0.03932 -4.205711 -2.150737
H  -0.702705 -3.19184 -0.922708
H  0.950741 -2.866463 -1.460277
H  -5.523559 0.038211 2.877891
H  -6.255678 -2.084684 1.783143
H  1.247707 -0.53559 2.983951
H  5.75321 0.109633 -0.269656
H  2.488992 3.190981 -0.924752
H  1.97003 1.854226 -1.980599
H  3.187865 3.016243 -2.544438
H  5.073909 -1.63873 3.831782
H  6.233219 -2.781397 3.118381
H  4.494992 -2.944424 2.785342
H  0.900992 1.539556 0.250295
totalener: -2272.18419308 hartree
nucrepener: 3858.92865965 hartree
electener: -6131.11285273 hartree
twoeener: 4664.17023681 hartree
kineticenergy: 2264.63210497 hartree
xcener: -174.193392780999 hartree
chargesum: -0.0000000
charge: 0.820776 0.855827 -0.452279 -0.513749 -0.450805 -0.430104 -0.408259 -0.259441 -0.263563 0.044035 -0.366562 -0.205705 -0.168376 -0.411355 -0.414884 -0.175451 0.125291 0.223054 -0.118442 0.030707 -0.211597 -0.255100 -0.154493 -0.069434 0.354843 0.364767 0.413627 0.387512 -0.304165 -0.131811 -0.123935 0.112775 0.116299 0.162621 0.133353 0.090968 0.095156 0.098228 0.133057 0.136049 0.165873 0.126489 0.103007 0.126378 0.124383 0.106547 0.122602 0.105315 0.209972
qa: 0.8208 0.8558 -0.4523 -0.5137 -0.4508 -0.4301 -0.4083 -0.2594 -0.2636 0.0440 -0.3666 -0.2057 -0.1684 -0.4114 -0.4149 -0.1755 0.1253 0.2231 -0.1184 0.0307 -0.2116 -0.2551 -0.1545 -0.0694 0.3548 0.3648 0.4136 0.3875 -0.3042 -0.1318 -0.1239 0.1128 0.1163 0.1626 0.1334 0.0910 0.0952 0.0982 0.1331 0.1360 0.1659 0.1265 0.1030 0.1264 0.1244 0.1065 0.1226 0.1053 0.2100
va: 5.5453 5.9011 2.0368 1.9650 2.0469 2.0776 2.1038 2.1684 2.1481 3.5069 3.0652 3.0896 3.1588 2.9759 2.9685 3.8735 3.8683 3.9931 3.8793 3.9062 3.9956 3.9357 3.9264 3.9291 4.3910 4.2499 4.0209 4.0531 3.9439 3.8437 3.8812 1.0325 1.0197 1.0254 1.0127 1.0042 1.0094 1.0139 1.0035 0.9972 1.0371 1.0227 0.9942 1.0086 0.9970 0.9973 0.9942 0.9975 1.0715
dispcorr: -0.030732802 hartree
energy: -2272.214925881641
dipole: 9.54437 -9.40456 0.13981 -16.36703 14.08974 -2.27730 1.77214 -0.37112 1.40102
magnitude: 2.67740 au
magnitude: 6.80542 debye
