program: Orca
programVersion: 5.0.2
elementType: S S O O O O O O O N N N N N N C C C C C C C C C C C C C C C C H H H H H H H H H H H H H H H H H H
charge: 0
multiplicity: 1
keywords: wb97x-d3
keywords: def2-TZVPP
keywords: def2/J RIJCOSX
keywords: DEFGRID2
keywords: scfconv7
keywords: smallprint printgap noloewdin
keywords: NOSOSCF
formula: C16H18N6O7S2
InChI: InChI=1S/C16H18N6O7S2/c1-4-30(24,25)13-14(22-8-6-5-7-10(22)17-13)31(26,27)21-16(23)20-15-18-11(28-2)9-12(19-15)29-3/h5-9,20-21H,4H2,1-3H3
49 atoms
S  -1.043998 1.008623 2.414946
S  -1.12392 -1.653568 -0.067622
O  0.251879 0.570013 1.915013
O  -1.236087 2.380647 2.835638
O  -1.710083 -2.530531 -1.051717
O  -0.751726 -2.156848 1.234085
O  -0.715641 -0.008162 -2.466226
O  4.17125 -1.157102 1.30766
O  5.916865 1.402569 -2.151343
N  -3.335146 -0.055467 -0.609748
N  -3.312332 1.453095 1.043281
N  0.266894 -0.990585 -0.668752
N  1.496335 0.315551 -2.140474
N  2.82131 -0.44278 -0.38771
N  3.701758 0.860388 -2.146041
C  -2.210483 -0.298643 0.148027
C  -2.245105 0.667786 1.138141
C  -3.975886 1.016329 -0.014006
C  -1.557863 -0.076196 3.747438
C  -3.819054 -0.636409 -1.748613
C  -5.17987 1.494747 -0.558752
C  -0.629971 0.090017 4.93979
C  -4.980071 -0.174348 -2.274623
C  -5.67982 0.89811 -1.674906
C  0.269564 -0.221357 -1.801532
C  2.723905 0.232346 -1.519086
C  4.023344 -0.49908 0.176197
C  4.895795 0.793315 -1.575243
C  5.133009 0.109587 -0.388905
C  3.023908 -1.723591 1.930543
C  5.683134 2.133989 -3.343754
H  -2.584759 0.199965 3.991006
H  -1.544053 -1.093393 3.358056
H  -3.244773 -1.437855 -2.176983
H  -5.663856 2.326657 -0.068925
H  0.394294 -0.176525 4.685378
H  -0.956042 -0.569047 5.742953
H  -0.641101 1.110914 5.31645
H  -5.356203 -0.641134 -3.172616
H  -6.604272 1.246259 -2.113659
H  1.484533 0.872668 -2.981452
H  6.109281 0.066152 0.068451
H  2.561627 -2.491892 1.308714
H  2.279794 -0.965613 2.175033
H  3.388032 -2.183207 2.845344
H  5.317533 1.493807 -4.147024
H  6.646011 2.552827 -3.623559
H  4.966874 2.941451 -3.189004
H  1.104985 -0.983773 -0.07465
totalener: -2272.18506000 hartree
nucrepener: 3793.45150372 hartree
electener: -6065.63656372 hartree
twoeener: 4598.64134983 hartree
kineticenergy: 2264.63945724 hartree
xcener: -174.195596872187 hartree
chargesum: 0.0000000
charge: 0.851956 0.869004 -0.512688 -0.453407 -0.454177 -0.466632 -0.404177 -0.262410 -0.262798 0.039459 -0.277706 -0.196976 -0.162375 -0.422605 -0.415708 -0.141675 0.010048 0.211244 -0.170376 0.024776 -0.201714 -0.265827 -0.154549 -0.068987 0.361469 0.371107 0.408460 0.389939 -0.299690 -0.134299 -0.123986 0.120765 0.132575 0.162514 0.136609 0.095576 0.089974 0.108029 0.132629 0.135693 0.166861 0.127156 0.105282 0.120624 0.124702 0.106442 0.122924 0.107887 0.219060
qa: 0.8520 0.8690 -0.5127 -0.4534 -0.4542 -0.4666 -0.4042 -0.2624 -0.2628 0.0395 -0.2777 -0.1970 -0.1624 -0.4226 -0.4157 -0.1417 0.0100 0.2112 -0.1704 0.0248 -0.2017 -0.2658 -0.1545 -0.0690 0.3615 0.3711 0.4085 0.3899 -0.2997 -0.1343 -0.1240 0.1208 0.1326 0.1625 0.1366 0.0956 0.0900 0.1080 0.1326 0.1357 0.1669 0.1272 0.1053 0.1206 0.1247 0.1064 0.1229 0.1079 0.2191
va: 5.5550 5.8869 1.9551 2.0531 2.0455 2.0288 2.1122 2.1652 2.1514 3.5070 3.1490 3.0987 3.1668 2.9743 2.9709 3.8672 4.0047 3.9985 3.8488 3.9066 3.9890 3.9552 3.9231 3.9190 4.3878 4.2416 4.0206 4.0570 3.9410 3.8641 3.8793 1.0173 1.0187 1.0260 1.0128 1.0082 1.0017 1.0116 1.0035 0.9974 1.0366 1.0227 0.9965 1.0031 0.9955 0.9970 0.9943 0.9973 1.0477
dispcorr: -0.029589779 hartree
energy: -2272.214649783529
dipole: 7.28502 -7.42469 -0.13967 1.43438 -1.61105 -0.17667 7.14338 -7.89105 -0.74767
magnitude: 0.78085 au
magnitude: 1.98476 debye
