program: Orca
programVersion: 5.0.2
elementType: S S O O O O O O O N N N N N N C C C C C C C C C C C C C C C C H H H H H H H H H H H H H H H H H H
charge: 0
multiplicity: 1
keywords: wb97x-d3
keywords: def2-TZVPP
keywords: def2/J RIJCOSX
keywords: DEFGRID2
keywords: scfconv7
keywords: smallprint printgap noloewdin
keywords: NOSOSCF
formula: C16H18N6O7S2
InChI: InChI=1S/C16H18N6O7S2/c1-4-30(24,25)13-14(22-8-6-5-7-10(22)17-13)31(26,27)21-16(23)20-15-18-11(28-2)9-12(19-15)29-3/h5-9,20-21H,4H2,1-3H3
49 atoms
S  -1.014723 1.049881 2.385361
S  -1.13465 -1.662466 -0.046697
O  0.273356 0.59015 1.884142
O  -1.194626 2.433169 2.772336
O  -1.730896 -2.549377 -1.015804
O  -0.760031 -2.150295 1.260153
O  -0.726364 -0.043482 -2.46375
O  4.157911 -1.179499 1.314031
O  5.904852 1.377754 -2.146511
N  -3.339975 -0.05776 -0.597657
N  -3.293985 1.477644 1.029866
N  0.25787 -1.017421 -0.66267
N  1.487281 0.276999 -2.143907
N  2.810982 -0.473979 -0.387097
N  3.691464 0.828352 -2.145936
C  -2.210797 -0.295897 0.154743
C  -2.230903 0.687166 1.128827
C  -3.969158 1.027964 -0.014322
C  -1.520936 0.002315 3.750704
C  -3.836238 -0.652742 -1.723893
C  -5.173997 1.506035 -0.557482
C  -0.577534 0.191001 4.927453
C  -4.997711 -0.190471 -2.24872
C  -5.686003 0.895845 -1.660675
C  0.25972 -0.255051 -1.799753
C  2.713985 0.198846 -1.519996
C  4.011617 -0.524924 0.180401
C  4.884119 0.766454 -1.571705
C  5.120666 0.086125 -0.383284
C  3.009604 -1.747163 1.934843
C  5.671221 2.107318 -3.340083
H  -2.542638 0.292787 3.999383
H  -1.519896 -1.024363 3.386327
H  -3.270407 -1.464593 -2.143906
H  -5.648345 2.348977 -0.077085
H  -0.573381 1.222026 5.275793
H  0.440872 -0.093628 4.669127
H  -0.90149 -0.441752 5.752375
H  -5.383359 -0.667961 -3.136986
H  -6.611083 1.243558 -2.098457
H  1.475851 0.830989 -2.986955
H  6.09588 0.047205 0.076728
H  2.263712 -0.989782 2.175471
H  3.372074 -2.204315 2.851496
H  2.550702 -2.517351 1.312966
H  5.311919 1.464713 -4.144285
H  6.632765 2.531368 -3.616808
H  4.950029 2.910949 -3.188214
H  1.098711 -1.008229 -0.07188
totalener: -2272.18499699 hartree
nucrepener: 3795.67387238 hartree
electener: -6067.85886938 hartree
twoeener: 4600.87353961 hartree
kineticenergy: 2264.63735849 hartree
xcener: -174.195089455857 hartree
chargesum: -0.0000000
charge: 0.852498 0.869035 -0.512858 -0.452950 -0.454296 -0.466539 -0.403661 -0.262409 -0.262838 0.039466 -0.278145 -0.197075 -0.162204 -0.421456 -0.415581 -0.140772 0.009277 0.211032 -0.170429 0.024247 -0.201397 -0.265687 -0.154254 -0.069131 0.360641 0.370722 0.408684 0.390111 -0.299860 -0.133465 -0.123977 0.121003 0.131946 0.162571 0.136611 0.108098 0.095515 0.090127 0.132589 0.135655 0.166805 0.127096 0.119320 0.124802 0.105701 0.106408 0.122920 0.107883 0.218224
qa: 0.8525 0.8690 -0.5129 -0.4529 -0.4543 -0.4665 -0.4037 -0.2624 -0.2628 0.0395 -0.2781 -0.1971 -0.1622 -0.4215 -0.4156 -0.1408 0.0093 0.2110 -0.1704 0.0242 -0.2014 -0.2657 -0.1543 -0.0691 0.3606 0.3707 0.4087 0.3901 -0.2999 -0.1335 -0.1240 0.1210 0.1319 0.1626 0.1366 0.1081 0.0955 0.0901 0.1326 0.1357 0.1668 0.1271 0.1193 0.1248 0.1057 0.1064 0.1229 0.1079 0.2182
va: 5.5557 5.8867 1.9553 2.0532 2.0454 2.0292 2.1127 2.1654 2.1513 3.5066 3.1491 3.0981 3.1669 2.9746 2.9712 3.8670 4.0035 3.9988 3.8497 3.9070 3.9889 3.9549 3.9226 3.9194 4.3890 4.2423 4.0202 4.0569 3.9413 3.8641 3.8793 1.0173 1.0185 1.0259 1.0127 1.0117 1.0081 1.0016 1.0035 0.9974 1.0366 1.0227 1.0030 0.9955 0.9965 0.9969 0.9942 0.9973 1.0496
dispcorr: -0.029650017 hartree
energy: -2272.214647008858
dipole: 7.35564 -7.50378 -0.14814 1.65476 -1.82568 -0.17092 7.21255 -7.92219 -0.70964
magnitude: 0.74481 au
magnitude: 1.89316 debye
