program: Orca
programVersion: 5.0.2
elementType: S S O O O O O O O N N N N N N C C C C C C C C C C C C C C C C H H H H H H H H H H H H H H H H H H
charge: 0
multiplicity: 1
keywords: wb97x-d3
keywords: def2-TZVPP
keywords: def2/J RIJCOSX
keywords: DEFGRID2
keywords: scfconv7
keywords: smallprint printgap noloewdin
keywords: NOSOSCF
formula: C16H18N6O7S2
InChI: InChI=1S/C16H18N6O7S2/c1-4-30(24,25)13-14(22-8-6-5-7-10(22)17-13)31(26,27)21-16(23)20-15-18-11(28-2)9-12(19-15)29-3/h5-9,20-21H,4H2,1-3H3
49 atoms
S  -1.007423 1.089108 2.38346
S  -1.138022 -1.661888 -0.005491
O  0.278432 0.616536 1.88919
O  -1.182539 2.479993 2.744878
O  -1.735498 -2.561216 -0.961903
O  -0.7625 -2.13278 1.307048
O  -0.73514 -0.078068 -2.443393
O  4.173993 -1.146796 1.329946
O  5.908608 1.289845 -2.222194
N  -3.339858 -0.058307 -0.578051
N  -3.284355 1.503359 1.023942
N  0.255598 -1.026985 -0.632272
N  1.480213 0.24255 -2.139842
N  2.813878 -0.473865 -0.375015
N  3.689469 0.767311 -2.179784
C  -2.211801 -0.290598 0.177899
C  -2.225721 0.708396 1.135498
C  -3.962127 1.041041 -0.012702
C  -1.516055 0.069463 3.769354
C  -3.840638 -0.668601 -1.69401
C  -5.162783 1.519399 -0.564754
C  -0.581376 0.290728 4.947287
C  -4.998153 -0.206068 -2.227471
C  -5.678212 0.895452 -1.658567
C  0.253651 -0.281346 -1.780919
C  2.712082 0.166917 -1.525755
C  4.020551 -0.52298 0.17986
C  4.887847 0.708056 -1.617747
C  5.129873 0.059211 -0.413041
C  3.026691 -1.677346 1.984434
C  5.6719 1.97544 -3.440849
H  -2.540833 0.35988 4.005076
H  -1.50743 -0.96499 3.428023
H  -3.281317 -1.492033 -2.099995
H  -5.631114 2.373941 -0.099212
H  -0.911509 -0.318805 5.786936
H  -0.580316 1.330993 5.266797
H  0.43878 -0.00043 4.704434
H  -5.387252 -0.69526 -3.107839
H  -6.599743 1.244031 -2.103112
H  1.466692 0.778179 -2.994588
H  6.109848 0.021367 0.036843
H  2.549582 -2.462096 1.39528
H  2.293578 -0.902647 2.208353
H  3.395295 -2.107885 2.911502
H  4.960696 2.791976 -3.314209
H  5.29855 1.306032 -4.216161
H  6.635383 2.377357 -3.741949
H  1.094948 -1.003303 -0.040434
totalener: -2272.18503760 hartree
nucrepener: 3794.39402610 hartree
electener: -6066.57906370 hartree
twoeener: 4599.59715840 hartree
kineticenergy: 2264.63967939 hartree
xcener: -174.195383263173 hartree
chargesum: -0.0000000
charge: 0.853557 0.868648 -0.513313 -0.453143 -0.453987 -0.465760 -0.404151 -0.262512 -0.262912 0.039205 -0.278285 -0.198112 -0.162020 -0.421960 -0.415776 -0.139953 0.008989 0.211127 -0.169858 0.023844 -0.201616 -0.265846 -0.154040 -0.069245 0.361379 0.371126 0.408144 0.389824 -0.299779 -0.133733 -0.123834 0.120775 0.131584 0.162952 0.136585 0.090203 0.108262 0.095332 0.132650 0.135806 0.166834 0.127054 0.104811 0.120708 0.124561 0.107936 0.106234 0.122838 0.218869
qa: 0.8536 0.8686 -0.5133 -0.4531 -0.4540 -0.4658 -0.4042 -0.2625 -0.2629 0.0392 -0.2783 -0.1981 -0.1620 -0.4220 -0.4158 -0.1400 0.0090 0.2111 -0.1699 0.0238 -0.2016 -0.2658 -0.1540 -0.0692 0.3614 0.3711 0.4081 0.3898 -0.2998 -0.1337 -0.1238 0.1208 0.1316 0.1630 0.1366 0.0902 0.1083 0.0953 0.1326 0.1358 0.1668 0.1271 0.1048 0.1207 0.1246 0.1079 0.1062 0.1228 0.2189
va: 5.5550 5.8872 1.9557 2.0528 2.0459 2.0304 2.1118 2.1648 2.1513 3.5070 3.1484 3.0987 3.1665 2.9749 2.9707 3.8665 4.0020 3.9990 3.8503 3.9069 3.9893 3.9552 3.9223 3.9196 4.3874 4.2415 4.0208 4.0572 3.9410 3.8639 3.8794 1.0171 1.0186 1.0256 1.0128 1.0017 1.0119 1.0080 1.0035 0.9974 1.0366 1.0227 0.9966 1.0037 0.9953 0.9972 0.9971 0.9943 1.0482
dispcorr: -0.029615985 hartree
energy: -2272.214653585068
dipole: 7.36913 -7.52870 -0.15958 1.80078 -1.97562 -0.17484 7.12182 -7.83219 -0.71037
magnitude: 0.74877 au
magnitude: 1.90322 debye
