program: Orca
programVersion: 5.0.2
elementType: S S O O O O O O O N N N N N N C C C C C C C C C C C C C C C C H H H H H H H H H H H H H H H H H H
charge: 0
multiplicity: 1
keywords: wb97x-d3
keywords: def2-TZVPP
keywords: def2/J RIJCOSX
keywords: DEFGRID2
keywords: scfconv7
keywords: smallprint printgap noloewdin
keywords: NOSOSCF
formula: C16H18N6O7S2
InChI: InChI=1S/C16H18N6O7S2/c1-4-30(24,25)13-14(22-8-6-5-7-10(22)17-13)31(26,27)21-16(23)20-15-18-11(28-2)9-12(19-15)29-3/h5-9,20-21H,4H2,1-3H3
49 atoms
S  -0.61218 -0.419446 -2.456297
S  -1.449193 1.94833 0.147719
O  -1.096982 0.096232 -3.71855
O  0.531303 0.184888 -1.784919
O  -2.279461 2.622667 1.114683
O  -1.034041 2.602753 -1.065558
O  -1.047973 0.105807 2.399018
O  3.93622 1.923456 -0.975072
O  5.386276 -1.729688 1.495953
N  -3.367085 -0.074495 0.336215
N  -2.833484 -1.447585 -1.344925
N  -0.0340 1.449138 0.870758
N  1.179157 -0.102477 2.108409
N  2.552826 0.956111 0.562197
N  3.281755 -0.908597 1.8117
C  -2.243935 0.443805 -0.272023
C  -1.960228 -0.44308 -1.289284
C  -3.689164 -1.224242 -0.360255
C  -0.270984 -2.172557 -2.640443
C  -4.084476 0.328306 1.42722
C  -4.805893 -1.981908 0.031157
C  0.304494 -2.79941 -1.385997
C  -5.160371 -0.403839 1.808583
C  -5.535842 -1.57063 1.104244
C  -0.046244 0.473882 1.832228
C  2.389851 -0.001561 1.455361
C  3.725417 0.999468 -0.06257
C  4.45195 -0.844816 1.192521
C  4.746838 0.105203 0.223366
C  2.877769 2.813692 -1.316025
C  5.090426 -2.718376 2.468338
H  -1.197915 -2.646612 -2.959971
H  0.434297 -2.206312 -3.474418
H  -3.751086 1.215171 1.935922
H  -5.044818 -2.869854 -0.535026
H  -0.398969 -2.756542 -0.555711
H  1.229536 -2.312291 -1.084333
H  0.523631 -3.849866 -1.573821
H  -5.722064 -0.077983 2.671041
H  -6.399512 -2.135569 1.425502
H  1.136734 -0.838097 2.797545
H  5.701034 0.141079 -0.279216
H  2.559105 3.407089 -0.457893
H  2.021452 2.281424 -1.728965
H  3.288994 3.476013 -2.072482
H  5.990059 -3.321875 2.555809
H  4.257286 -3.351751 2.161866
H  4.853059 -2.277925 3.436987
H  0.839644 1.590318 0.348874
totalener: -2272.18332035 hartree
nucrepener: 3875.33967971 hartree
electener: -6147.52300006 hartree
twoeener: 4680.34301652 hartree
kineticenergy: 2264.64209032 hartree
xcener: -174.194747936192 hartree
chargesum: 0.0000000
charge: 0.837201 0.863774 -0.450512 -0.512337 -0.454090 -0.427068 -0.403094 -0.258310 -0.263009 0.046031 -0.352631 -0.203551 -0.164482 -0.410200 -0.413763 -0.155004 0.072396 0.222899 -0.127432 0.020880 -0.210900 -0.262187 -0.151018 -0.069185 0.342924 0.353434 0.415087 0.385651 -0.303893 -0.136797 -0.123617 0.117616 0.114603 0.167762 0.133249 0.093785 0.095654 0.097425 0.133442 0.136010 0.166869 0.127051 0.104067 0.129915 0.126096 0.122993 0.104523 0.107007 0.214735
qa: 0.8372 0.8638 -0.4505 -0.5123 -0.4541 -0.4271 -0.4031 -0.2583 -0.2630 0.0460 -0.3526 -0.2036 -0.1645 -0.4102 -0.4138 -0.1550 0.0724 0.2229 -0.1274 0.0209 -0.2109 -0.2622 -0.1510 -0.0692 0.3429 0.3534 0.4151 0.3857 -0.3039 -0.1368 -0.1236 0.1176 0.1146 0.1678 0.1332 0.0938 0.0957 0.0974 0.1334 0.1360 0.1669 0.1271 0.1041 0.1299 0.1261 0.1230 0.1045 0.1070 0.2147
va: 5.5663 5.8955 2.0441 1.9751 2.0465 2.0799 2.1053 2.1668 2.1491 3.5097 3.0679 3.0963 3.1570 2.9639 2.9532 3.8525 3.9108 3.9970 3.8692 3.9046 3.9918 3.9382 3.9160 3.9269 4.3970 4.2457 4.0182 4.0504 3.9463 3.8476 3.8811 1.0332 1.0207 1.0242 1.0129 1.0074 1.0123 1.0051 1.0033 0.9970 1.0369 1.0226 0.9929 1.0041 0.9960 0.9944 0.9974 0.9974 1.0596
dispcorr: -0.031514148 hartree
energy: -2272.214834502160
dipole: 10.71366 -10.40368 0.30998 -16.02582 13.71060 -2.31521 2.51917 -1.08027 1.43891
magnitude: 2.74349 au
magnitude: 6.97340 debye
