program: Orca
programVersion: 5.0.2
elementType: S S O O O O O O O N N N N N N C C C C C C C C C C C C C C C C H H H H H H H H H H H H H H H H H H
charge: 0
multiplicity: 1
keywords: wb97x-d3
keywords: def2-TZVPP
keywords: def2/J RIJCOSX
keywords: DEFGRID2
keywords: scfconv7
keywords: smallprint printgap noloewdin
keywords: NOSOSCF
formula: C16H18N6O7S2
InChI: InChI=1S/C16H18N6O7S2/c1-4-30(24,25)13-14(22-8-6-5-7-10(22)17-13)31(26,27)21-16(23)20-15-18-11(28-2)9-12(19-15)29-3/h5-9,20-21H,4H2,1-3H3
49 atoms
S  -0.948428 -0.956518 2.378439
S  -1.341252 1.860708 0.168486
O  0.324564 -0.480535 1.850749
O  -1.458447 -0.471907 3.643244
O  -0.999813 2.248115 1.512023
O  -2.019946 2.766436 -0.725326
O  -0.826004 0.480521 -2.367252
O  3.985496 1.428093 1.569477
O  5.826377 -0.791531 -2.069085
N  -3.371276 0.076958 -0.545704
N  -3.120328 -1.594333 0.917327
N  0.102712 1.391226 -0.505248
N  1.399416 0.257606 -2.062083
N  2.677446 0.876299 -0.219901
N  3.608273 -0.262304 -2.066085
C  -2.279677 0.382995 0.238393
C  -2.173013 -0.67855 1.112411
C  -3.850213 -1.136293 -0.087767
C  -0.883516 -2.750934 2.435049
C  -3.944241 0.721214 -1.604788
C  -4.974163 -1.713784 -0.70107
C  -0.296051 -3.371198 1.183772
C  -5.0290 0.164641 -2.19883
C  -5.559422 -1.064107 -1.74479
C  0.147065 0.703431 -1.686301
C  2.611934 0.302633 -1.40775
C  3.864636 0.880003 0.379461
C  4.787615 -0.24312 -1.462539
C  4.990527 0.32554 -0.211589
C  2.828398 1.954178 2.214437
C  5.632605 -1.375558 -3.346799
H  -0.267442 -2.948128 3.316003
H  -1.893406 -3.101382 2.643317
H  -3.495917 1.646894 -1.918882
H  -5.3365 -2.657406 -0.32078
H  -0.92116 -3.186591 0.311835
H  -0.227389 -4.450815 1.31366
H  0.703994 -2.992653 0.983122
H  -5.477197 0.680798 -3.034424
H  -6.426678 -1.486442 -2.232586
H  1.417509 -0.222754 -2.948881
H  5.955385 0.330995 0.271393
H  2.396005 2.783232 1.652476
H  3.175533 2.322428 3.175642
H  2.068194 1.190332 2.371691
H  5.29968 -0.641516 -4.081293
H  4.907303 -2.188989 -3.315417
H  6.603198 -1.766467 -3.640354
H  0.934576 1.374451 0.096842
totalener: -2272.18537173 hartree
nucrepener: 3829.82052995 hartree
electener: -6102.00590168 hartree
twoeener: 4634.99733024 hartree
kineticenergy: 2264.64175139 hartree
xcener: -174.195979860844 hartree
chargesum: 0.0000000
charge: 0.831340 0.853747 -0.517613 -0.451009 -0.427599 -0.454616 -0.408898 -0.260412 -0.263306 0.043149 -0.359714 -0.203821 -0.163874 -0.416802 -0.417384 -0.149191 0.092297 0.222977 -0.126199 0.023632 -0.209864 -0.256674 -0.152494 -0.066909 0.356612 0.367358 0.405642 0.387607 -0.303839 -0.135987 -0.123643 0.115044 0.115031 0.165589 0.131968 0.094220 0.092738 0.099466 0.132553 0.135137 0.166013 0.127022 0.102974 0.124149 0.131146 0.106595 0.105253 0.123094 0.217496
qa: 0.8313 0.8537 -0.5176 -0.4510 -0.4276 -0.4546 -0.4089 -0.2604 -0.2633 0.0431 -0.3597 -0.2038 -0.1639 -0.4168 -0.4174 -0.1492 0.0923 0.2230 -0.1262 0.0236 -0.2099 -0.2567 -0.1525 -0.0669 0.3566 0.3674 0.4056 0.3876 -0.3038 -0.1360 -0.1236 0.1150 0.1150 0.1656 0.1320 0.0942 0.0927 0.0995 0.1326 0.1351 0.1660 0.1270 0.1030 0.1241 0.1311 0.1066 0.1053 0.1231 0.2175
va: 5.5478 5.9080 1.9665 2.0411 2.0797 2.0447 2.1048 2.1663 2.1491 3.5126 3.0638 3.1033 3.1579 2.9738 2.9690 3.8541 3.8946 3.9943 3.8760 3.9039 3.9929 3.9337 3.9184 3.9250 4.3876 4.2417 4.0269 4.0546 3.9389 3.8415 3.8805 1.0204 1.0329 1.0247 1.0133 1.0085 1.0039 1.0142 1.0037 0.9974 1.0372 1.0228 0.9959 0.9962 1.0101 0.9972 0.9976 0.9942 1.0539
dispcorr: -0.030104877 hartree
energy: -2272.215476604956
dipole: 9.62801 -9.38453 0.24349 -15.17791 13.24230 -1.93561 -4.54537 2.71919 -1.82618
magnitude: 2.67223 au
magnitude: 6.79226 debye
