program: Orca
programVersion: 4.2.1
elementType: S O O O O O O N N N N N N C C C C C C C C C C C C C C C C H H H H H H H H H H H H H H H H H H H H
charge: 0
multiplicity: 1
keywords: wb97x-d3
keywords: def2-TZVPP
keywords: def2/J RIJCOSX GRIDX6 NOFINALGRIDX
keywords: grid4 nofinalgrid
keywords: scfconv7
keywords: smallprint printgap noloewdin
keywords: NOSOSCF
formula: C16H20N6O6S
InChI: InChI=1S/C16H20N6O6S/c1-22(2)14(23)10-7-5-6-8-11(10)20-29(25,26)21-16(24)19-15-17-12(27-3)9-13(18-15)28-4/h5-9,19-21H,1-4H3
49 atoms
S  1.545831 1.117675 1.998772
O  1.947134 2.501652 2.091422
O  1.274113 0.372526 3.208482
O  4.230565 0.880389 -1.158601
O  0.88925 1.952598 -0.757426
O  -5.520498 -0.249636 -1.364773
O  -3.406785 -1.037003 2.690707
N  2.704621 0.373299 1.107289
N  2.881542 0.510411 -2.924439
N  0.140212 0.947719 1.135201
N  -1.218507 1.137537 -0.734073
N  -3.363652 0.447086 -1.059073
N  -2.299948 0.044445 1.007701
C  2.459249 -0.834047 0.420092
C  2.729319 -0.923453 -0.953461
C  3.317273 0.238015 -1.687796
C  1.965407 -1.940762 1.101756
C  2.558011 -2.148407 -1.593247
C  1.760316 -3.136975 0.43424
C  2.072579 -3.251159 -0.911592
C  3.541523 1.567821 -3.667498
C  1.579355 0.132055 -3.441795
C  0.001106 1.387351 -0.153121
C  -2.340806 0.512009 -0.228175
C  -4.453262 -0.147984 -0.591676
C  -3.398819 -0.5510 1.461403
C  -4.539027 -0.680731 0.689428
C  -5.474182 0.278773 -2.688473
C  -2.234822 -0.907794 3.492879
H  3.300583 1.028705 0.605703
H  1.76517 -1.885253 2.162095
H  2.810307 -2.244864 -2.641084
H  1.378545 -3.988827 0.98016
H  1.944648 -4.192133 -1.42818
H  -0.667685 0.472502 1.565478
H  3.328128 1.434812 -4.72608
H  4.619018 1.528637 -3.534593
H  3.185603 2.555621 -3.367019
H  1.023341 -0.47756 -2.738814
H  0.992603 1.02961 -3.641842
H  1.677958 -0.423943 -4.374067
H  -5.432687 -1.163466 1.056608
H  -5.296032 1.353514 -2.687692
H  -6.452767 0.079869 -3.116049
H  -4.712735 -0.213809 -3.292009
H  -2.477636 -1.370425 4.445167
H  -1.97772 0.137429 3.665622
H  -1.38716 -1.434701 3.053701
H  -1.301028 1.469369 -1.686138
elementType: S O N C H
totalener: -1800.02276241 hartree
nucrepener: 3228.84272341 hartree
electener: -5028.86548582 hartree
oneelecener: -8886.44273125 hartree
twoeener: 3857.57724544 hartree
cpcmener: -0.05574299 hartree
kineticenergy: 1793.37478193 hartree
xcener: -149.353490385685 hartree
chargesum: 0.0000000
charge: 0.878145 -0.503293 -0.505288 -0.562666 -0.464207 -0.299429 -0.297498 -0.193103 -0.099451 -0.190157 -0.128080 -0.428286 -0.428931 0.022633 -0.005199 0.362261 -0.196884 -0.154772 -0.118255 -0.166790 -0.175308 -0.198163 0.340892 0.379836 0.419224 0.423473 -0.321314 -0.115025 -0.122336 0.208910 0.163452 0.158489 0.165887 0.164586 0.212278 0.111894 0.105904 0.115942 0.117509 0.118170 0.134703 0.148375 0.114424 0.133288 0.114717 0.140389 0.115394 0.108638 0.195018
qa: 0.8781 -0.5033 -0.5053 -0.5627 -0.4642 -0.2994 -0.2975 -0.1931 -0.0995 -0.1902 -0.1281 -0.4283 -0.4289 0.0226 -0.0052 0.3623 -0.1969 -0.1548 -0.1183 -0.1668 -0.1753 -0.1982 0.3409 0.3798 0.4192 0.4235 -0.3213 -0.1150 -0.1223 0.2089 0.1635 0.1585 0.1659 0.1646 0.2123 0.1119 0.1059 0.1159 0.1175 0.1182 0.1347 0.1484 0.1144 0.1333 0.1147 0.1404 0.1154 0.1086 0.1950
va: 6.0226 1.9894 1.9754 1.9154 2.0494 2.1223 2.1330 3.0534 3.1377 3.0567 3.1880 2.9696 2.9789 3.8929 3.5792 4.0488 4.0268 3.9124 3.9342 3.9289 3.9010 3.8909 4.4237 4.2316 4.0177 3.9847 3.9305 3.8452 3.8458 1.0479 1.0140 0.9967 0.9875 0.9881 1.0713 0.9951 1.0063 0.9915 0.9920 0.9949 0.9919 1.0153 0.9954 0.9931 0.9953 0.9962 0.9918 0.9912 1.0138
dispcorr: -0.029424541 hartree
energy: -1800.052186954899
dipole: -4.16922 0.40941 -3.75981 -6.91520 4.24491 -2.67029 -18.43865 15.13178 -3.30687
magnitude: 5.67469 au
magnitude: 14.42391 debye
