program: Orca
programVersion: 4.2.1
elementType: S O O O O O O N N N N N N C C C C C C C C C C C C C C C C H H H H H H H H H H H H H H H H H H H H
charge: 0
multiplicity: 1
keywords: wb97x-d3
keywords: def2-TZVPP
keywords: def2/J RIJCOSX GRIDX6 NOFINALGRIDX
keywords: grid4 nofinalgrid
keywords: scfconv7
keywords: smallprint printgap noloewdin
keywords: NOSOSCF
formula: C16H20N6O6S
InChI: InChI=1S/C16H20N6O6S/c1-22(2)14(23)10-7-5-6-8-11(10)20-29(25,26)21-16(24)19-15-17-12(27-3)9-13(18-15)28-4/h5-9,19-21H,1-4H3
49 atoms
S  1.50462 1.02527 1.992512
O  1.872416 2.418451 2.099811
O  1.251434 0.26308 3.195924
O  4.276983 0.917089 -1.075555
O  0.831856 1.825434 -0.777864
O  -5.632605 -0.235281 -1.259282
O  -3.50364 -0.951117 2.80155
N  2.678447 0.319112 1.090746
N  3.044761 0.590843 -2.930523
N  0.103026 0.828486 1.128245
N  -1.280933 1.025551 -0.720306
N  -3.44917 0.393155 -0.999911
N  -2.37446 0.019434 1.066664
C  2.453617 -0.85983 0.351351
C  2.775203 -0.898569 -1.013951
C  3.401531 0.284511 -1.677472
C  1.92521 -1.986861 0.970808
C  2.612859 -2.095155 -1.707488
C  1.731806 -3.153304 0.249118
C  2.089332 -3.217458 -1.08871
C  3.761603 1.654793 -3.609916
C  1.786144 0.214055 -3.547468
C  -0.051149 1.269621 -0.15797
C  -2.414869 0.450456 -0.182545
C  -4.554196 -0.143957 -0.500367
C  -3.490897 -0.5131 1.554536
C  -4.645601 -0.623463 0.801117
C  -5.577756 0.232622 -2.605336
C  -2.315997 -0.844693 3.584169
H  3.285819 0.993849 0.628948
H  1.68679 -1.970996 2.024838
H  2.902473 -2.154856 -2.7482
H  1.321247 -4.021445 0.746355
H  1.968088 -4.135217 -1.64709
H  -0.710203 0.381143 1.578198
H  3.605405 1.550044 -4.681965
H  4.830106 1.59436 -3.418943
H  3.405214 2.641884 -3.306134
H  1.142953 -0.326855 -2.862395
H  1.254332 1.115554 -3.853307
H  1.947036 -0.400715 -4.433253
H  -5.553341 -1.055095 1.196183
H  -5.355275 1.297882 -2.653652
H  -6.567779 0.055892 -3.015997
H  -4.843236 -0.31732 -3.192561
H  -2.0071 0.19325 3.709169
H  -1.500137 -1.429268 3.158046
H  -2.567945 -1.254706 4.557944
H  -1.376941 1.354739 -1.671723
elementType: S O N C H
totalener: -1800.02249417 hartree
nucrepener: 3215.95928161 hartree
electener: -5015.98177578 hartree
oneelecener: -8860.83290719 hartree
twoeener: 3844.85113140 hartree
cpcmener: -0.05543278 hartree
kineticenergy: 1793.37002224 hartree
xcener: -149.353070636630 hartree
chargesum: 0.0000000
charge: 0.876564 -0.504640 -0.505576 -0.565305 -0.465997 -0.299732 -0.297468 -0.189858 -0.097730 -0.191004 -0.128055 -0.428106 -0.429333 0.016721 -0.003245 0.363127 -0.196937 -0.152736 -0.118263 -0.167296 -0.176855 -0.196579 0.349682 0.379100 0.419274 0.423230 -0.321204 -0.115048 -0.123561 0.209001 0.162861 0.158768 0.165506 0.164584 0.211831 0.112655 0.105156 0.117472 0.115579 0.120613 0.133411 0.148037 0.114036 0.133316 0.114839 0.114749 0.110829 0.140247 0.193342
qa: 0.8766 -0.5046 -0.5056 -0.5653 -0.4660 -0.2997 -0.2975 -0.1899 -0.0977 -0.1910 -0.1281 -0.4281 -0.4293 0.0167 -0.0032 0.3631 -0.1969 -0.1527 -0.1183 -0.1673 -0.1769 -0.1966 0.3497 0.3791 0.4193 0.4232 -0.3212 -0.1150 -0.1236 0.2090 0.1629 0.1588 0.1655 0.1646 0.2118 0.1127 0.1052 0.1175 0.1156 0.1206 0.1334 0.1480 0.1140 0.1333 0.1148 0.1147 0.1108 0.1402 0.1933
va: 6.0194 1.9879 1.9733 1.9121 2.0509 2.1219 2.1327 3.0549 3.1406 3.0560 3.1863 2.9699 2.9767 3.9002 3.5790 4.0501 4.0199 3.9153 3.9367 3.9291 3.9012 3.8934 4.4173 4.2336 4.0174 3.9849 3.9317 3.8454 3.8445 1.0492 1.0144 0.9948 0.9876 0.9882 1.0711 0.9945 1.0055 0.9898 0.9922 0.9943 0.9888 1.0154 0.9954 0.9932 0.9952 0.9923 0.9917 0.9959 1.0153
dispcorr: -0.028979549 hartree
energy: -1800.051473721541
dipole: -3.29403 -0.34040 -3.63443 -6.19983 3.66456 -2.53526 -18.71014 15.29477 -3.41537
magnitude: 5.59476 au
magnitude: 14.22076 debye
