program: Orca
programVersion: 4.2.1
elementType: S O O O O O O N N N N N N C C C C C C C C C C C C C C C C H H H H H H H H H H H H H H H H H H H H
charge: 0
multiplicity: 1
keywords: wb97x-d3
keywords: def2-TZVPP
keywords: def2/J RIJCOSX GRIDX6 NOFINALGRIDX
keywords: grid4 nofinalgrid
keywords: scfconv7
keywords: smallprint printgap noloewdin
keywords: NOSOSCF
formula: C16H20N6O6S
InChI: InChI=1S/C16H20N6O6S/c1-22(2)14(23)10-7-5-6-8-11(10)20-29(25,26)21-16(24)19-15-17-12(27-3)9-13(18-15)28-4/h5-9,19-21H,1-4H3
49 atoms
S  1.458851 0.920438 1.963766
O  1.731709 2.331209 2.105072
O  1.238772 0.118073 3.146397
O  4.235758 1.074425 -1.093846
O  0.776116 1.723814 -0.806741
O  -5.788745 -0.011367 -1.119362
O  -3.547198 -1.002799 2.820785
N  2.690495 0.316459 1.067518
N  3.033187 0.633535 -2.947622
N  0.084794 0.649601 1.072144
N  -1.344766 0.948411 -0.728066
N  -3.559095 0.463254 -0.935832
N  -2.427651 -0.051458 1.069094
C  2.578363 -0.87538 0.324146
C  2.915984 -0.878954 -1.037477
C  3.424879 0.361987 -1.696548
C  2.156416 -2.050199 0.936465
C  2.884074 -2.084632 -1.733539
C  2.091113 -3.228953 0.212276
C  2.472214 -3.255407 -1.120454
C  3.635338 1.759253 -3.636337
C  1.813506 0.132196 -3.55381
C  -0.097502 1.152277 -0.187684
C  -2.490722 0.42585 -0.162272
C  -4.675896 -0.017765 -0.406154
C  -3.556339 -0.525042 1.588337
C  -4.745617 -0.534491 0.882327
C  -5.761257 0.506044 -2.447534
C  -2.326255 -0.991228 3.557631
H  3.240809 1.041709 0.610933
H  1.903502 -2.057944 1.987023
H  3.19044 -2.112683 -2.770768
H  1.764036 -4.135068 0.703577
H  2.453933 -4.180465 -1.679613
H  -0.732593 0.216717 1.529277
H  3.547641 1.599907 -4.709551
H  4.690698 1.849078 -3.395207
H  3.137248 2.698969 -3.387059
H  1.202972 0.976103 -3.876616
H  2.027184 -0.483679 -4.427766
H  1.221637 -0.448195 -2.85445
H  -5.663622 -0.917869 1.302655
H  -6.777585 0.410479 -2.819051
H  -5.09098 -0.065723 -3.088308
H  -5.471008 1.555873 -2.466154
H  -1.564895 -1.610548 3.082945
H  -2.565108 -1.413382 4.529497
H  -1.950158 0.02233 3.698685
H  -1.458823 1.314452 -1.663943
elementType: S O N C H
totalener: -1800.02251744 hartree
nucrepener: 3201.48850391 hartree
electener: -5001.51102135 hartree
oneelecener: -8832.01123397 hartree
twoeener: 3830.50021261 hartree
cpcmener: -0.05483491 hartree
kineticenergy: 1793.37914272 hartree
xcener: -149.354448753177 hartree
chargesum: 0.0000000
charge: 0.876516 -0.503621 -0.505295 -0.565284 -0.469245 -0.299657 -0.297346 -0.190598 -0.095517 -0.190205 -0.130954 -0.426802 -0.428902 0.017314 -0.005379 0.361156 -0.194132 -0.146767 -0.118222 -0.171222 -0.178074 -0.195124 0.358874 0.376710 0.420109 0.424485 -0.322550 -0.115084 -0.124664 0.208195 0.162211 0.156426 0.165937 0.164667 0.208682 0.114273 0.104942 0.116618 0.119068 0.133170 0.116740 0.147856 0.133219 0.114598 0.114056 0.114010 0.140454 0.111591 0.192764
qa: 0.8765 -0.5036 -0.5053 -0.5653 -0.4692 -0.2997 -0.2973 -0.1906 -0.0955 -0.1902 -0.1310 -0.4268 -0.4289 0.0173 -0.0054 0.3612 -0.1941 -0.1468 -0.1182 -0.1712 -0.1781 -0.1951 0.3589 0.3767 0.4201 0.4245 -0.3226 -0.1151 -0.1247 0.2082 0.1622 0.1564 0.1659 0.1647 0.2087 0.1143 0.1049 0.1166 0.1191 0.1332 0.1167 0.1479 0.1332 0.1146 0.1141 0.1140 0.1405 0.1116 0.1928
va: 6.0173 1.9891 1.9738 1.9132 2.0481 2.1214 2.1326 3.0544 3.1393 3.0578 3.1838 2.9693 2.9786 3.9128 3.5750 4.0477 4.0272 3.9136 3.9354 3.9328 3.9011 3.8932 4.4105 4.2402 4.0159 3.9829 3.9311 3.8455 3.8441 1.0502 1.0156 0.9961 0.9873 0.9883 1.0735 0.9937 1.0083 0.9900 0.9950 0.9889 0.9912 1.0156 0.9932 0.9953 0.9954 0.9910 0.9956 0.9943 1.0155
dispcorr: -0.028594010 hartree
energy: -1800.051111452508
dipole: -2.99457 -0.49008 -3.48465 -5.84579 3.29157 -2.55422 -18.57413 15.19744 -3.37670
magnitude: 5.48351 au
magnitude: 13.93799 debye
