program: Orca
programVersion: 4.2.1
elementType: S O O O O O O N N N N N N C C C C C C C C C C C C C C C C H H H H H H H H H H H H H H H H H H H H
charge: 0
multiplicity: 1
keywords: wb97x-d3
keywords: def2-TZVPP
keywords: def2/J RIJCOSX GRIDX6 NOFINALGRIDX
keywords: grid4 nofinalgrid
keywords: scfconv7
keywords: smallprint printgap noloewdin
keywords: NOSOSCF
formula: C16H20N6O6S
InChI: InChI=1S/C16H20N6O6S/c1-22(2)14(23)10-7-5-6-8-11(10)20-29(25,26)21-16(24)19-15-17-12(27-3)9-13(18-15)28-4/h5-9,19-21H,1-4H3
49 atoms
S  0.363527 -2.350334 0.706598
O  0.878383 -2.455224 2.050266
O  -0.668139 -3.243968 0.231018
O  1.899236 -1.292064 -2.869576
O  1.377127 0.374078 1.398665
O  -4.595211 -0.423884 -0.353459
O  -4.373378 3.959649 1.154128
N  1.611328 -2.491514 -0.344364
N  2.246107 0.880562 -2.39715
N  -0.320497 -0.839529 0.497268
N  -0.597739 1.402857 1.036015
N  -2.59559 0.461131 0.314836
N  -2.474201 2.687899 1.086933
C  2.864621 -1.859027 -0.1511
C  3.285692 -0.843315 -1.016631
C  2.418951 -0.424164 -2.15916
C  3.699408 -2.296777 0.867123
C  4.563161 -0.313686 -0.862716
C  4.954097 -1.732151 1.028413
C  5.394796 -0.748238 0.156187
C  1.508508 1.28151 -3.581759
C  2.574382 1.955148 -1.478614
C  0.230901 0.305134 1.008813
C  -1.9526 1.510274 0.797854
C  -3.902996 0.599897 0.115703
C  -3.777829 2.81176 0.87857
C  -4.569742 1.781971 0.384377
C  -3.921681 -1.655534 -0.606759
C  -3.600569 5.032816 1.687358
H  1.298241 -2.49163 -1.313992
H  3.381845 -3.09649 1.520313
H  4.917956 0.443613 -1.549503
H  5.596674 -2.08208 1.824892
H  6.384106 -0.325067 0.262085
H  -1.315464 -0.799055 0.229987
H  0.430805 1.269626 -3.408478
H  1.733961 0.633832 -4.424341
H  1.800245 2.294849 -3.848649
H  1.700792 2.596669 -1.357345
H  2.84381 1.580575 -0.497893
H  3.39394 2.566019 -1.858832
H  -5.632092 1.894594 0.2261
H  -3.152817 -1.54461 -1.371485
H  -4.684484 -2.337456 -0.971442
H  -3.486284 -2.069738 0.302658
H  -3.140937 4.76517 2.638102
H  -4.302449 5.84635 1.847446
H  -2.828285 5.358087 0.991303
H  -0.161023 2.238725 1.401939
elementType: S O N C H
totalener: -1800.02053913 hartree
nucrepener: 3195.66013446 hartree
electener: -4995.68067359 hartree
oneelecener: -8820.71210904 hartree
twoeener: 3825.03143545 hartree
cpcmener: -0.05415050 hartree
kineticenergy: 1793.37698783 hartree
xcener: -149.349893532458 hartree
chargesum: 0.0000000
charge: 0.898711 -0.488061 -0.513471 -0.563450 -0.464165 -0.298108 -0.300273 -0.206494 -0.100032 -0.210321 -0.130777 -0.432834 -0.428344 0.119011 -0.045003 0.351425 -0.187122 -0.152243 -0.126494 -0.164710 -0.168790 -0.217582 0.339574 0.382907 0.424451 0.418360 -0.322202 -0.126586 -0.115645 0.198174 0.139936 0.159454 0.164202 0.164510 0.210555 0.116960 0.105486 0.112457 0.123874 0.123866 0.137595 0.146980 0.119055 0.139736 0.108601 0.114265 0.133490 0.114620 0.194451
qa: 0.8987 -0.4881 -0.5135 -0.5634 -0.4642 -0.2981 -0.3003 -0.2065 -0.1000 -0.2103 -0.1308 -0.4328 -0.4283 0.1190 -0.0450 0.3514 -0.1871 -0.1522 -0.1265 -0.1647 -0.1688 -0.2176 0.3396 0.3829 0.4245 0.4184 -0.3222 -0.1266 -0.1156 0.1982 0.1399 0.1595 0.1642 0.1645 0.2106 0.1170 0.1055 0.1125 0.1239 0.1239 0.1376 0.1470 0.1191 0.1397 0.1086 0.1143 0.1335 0.1146 0.1945
va: 6.0059 1.9889 1.9838 1.9195 2.0397 2.1306 2.1209 3.0611 3.1358 3.0716 3.1748 2.9746 2.9690 3.7592 3.6462 4.0628 4.0683 3.8995 3.9231 3.9228 3.8950 3.8827 4.4124 4.2274 3.9830 4.0192 3.9326 3.8388 3.8455 1.0477 1.0231 0.9941 0.9876 0.9884 1.0674 0.9890 1.0070 0.9951 0.9917 0.9994 0.9885 1.0157 0.9895 0.9960 0.9983 0.9956 0.9930 0.9952 1.0157
dispcorr: -0.028520443 hartree
energy: -1800.049059571522
dipole: 3.65745 -4.03654 -0.37909 16.33692 -12.07501 4.26191 -9.06241 8.21284 -0.84957
magnitude: 4.36227 au
magnitude: 11.08800 debye
