program: Orca
programVersion: 4.2.1
elementType: S O O O O O O N N N N N N C C C C C C C C C C C C C C C C H H H H H H H H H H H H H H H H H H H H
charge: 0
multiplicity: 1
keywords: wb97x-d3
keywords: def2-TZVPP
keywords: def2/J RIJCOSX GRIDX6 NOFINALGRIDX
keywords: grid4 nofinalgrid
keywords: scfconv7
keywords: smallprint printgap noloewdin
keywords: NOSOSCF
formula: C16H20N6O6S
InChI: InChI=1S/C16H20N6O6S/c1-22(2)14(23)10-7-5-6-8-11(10)20-29(25,26)21-16(24)19-15-17-12(27-3)9-13(18-15)28-4/h5-9,19-21H,1-4H3
49 atoms
S  1.116707 1.175766 -1.885783
O  1.127518 0.419189 -3.11384
O  0.895263 2.603311 -1.896923
O  2.994873 0.693945 1.647077
O  0.378972 -1.594936 -1.064412
O  -5.736035 -0.552817 1.697965
O  -3.38343 3.211631 0.341192
N  2.536165 0.925513 -1.105309
N  2.209704 -1.341016 2.199306
N  -0.10505 0.618569 -0.893019
N  -1.534086 -0.991411 -0.028243
N  -3.626166 -0.782722 0.846181
N  -2.439003 1.138222 0.162957
C  3.225381 -0.311171 -1.103974
C  3.395921 -1.027431 0.086711
C  2.837568 -0.499772 1.368183
C  3.796798 -0.77349 -2.281548
C  4.184323 -2.174292 0.074934
C  4.542477 -1.940916 -2.282417
C  4.751666 -2.636392 -1.101042
C  1.777226 -0.843694 3.492932
C  1.701168 -2.652954 1.844807
C  -0.365535 -0.709806 -0.698752
C  -2.575308 -0.164491 0.340721
C  -4.643609 -0.00551 1.192333
C  -3.468453 1.903723 0.511802
C  -4.630392 1.376754 1.046462
C  -5.798959 -1.96938 1.846352
C  -2.193981 3.755831 -0.229215
H  2.583357 1.422473 -0.216754
H  3.683865 -0.206376 -3.194041
H  4.362051 -2.714389 0.99561
H  4.983229 -2.290758 -3.205975
H  5.360334 -3.529896 -1.091667
H  -0.827149 1.287557 -0.582979
H  0.829279 -0.306628 3.42309
H  2.520915 -0.183256 3.930179
H  1.642082 -1.689415 4.163464
H  1.844269 -2.872386 0.793906
H  2.182336 -3.432972 2.435308
H  0.629742 -2.690164 2.046991
H  -5.470106 1.994987 1.327431
H  -6.786866 -2.177092 2.247713
H  -5.045695 -2.335137 2.543224
H  -5.68651 -2.481017 0.891199
H  -1.321315 3.555021 0.392334
H  -2.353824 4.829201 -0.273609
H  -2.027271 3.383572 -1.240129
H  -1.691155 -1.977822 0.131764
elementType: S O N C H
totalener: -1800.02046193 hartree
nucrepener: 3194.66410004 hartree
electener: -4994.68456197 hartree
oneelecener: -8818.80005773 hartree
twoeener: 3824.11549576 hartree
cpcmener: -0.05380616 hartree
kineticenergy: 1793.37693891 hartree
xcener: -149.351156902209 hartree
chargesum: 0.0000000
charge: 0.899642 -0.487800 -0.514028 -0.562148 -0.465226 -0.300405 -0.297909 -0.204689 -0.104490 -0.207240 -0.134692 -0.427857 -0.429304 0.113901 -0.027086 0.341161 -0.186486 -0.159264 -0.128424 -0.160305 -0.166399 -0.213246 0.342980 0.378853 0.419644 0.425417 -0.323651 -0.114477 -0.128846 0.196828 0.139321 0.158257 0.163971 0.164297 0.211447 0.113822 0.105909 0.112790 0.125073 0.137361 0.120785 0.147375 0.132732 0.114759 0.113946 0.118547 0.140016 0.110458 0.194678
qa: 0.8996 -0.4878 -0.5140 -0.5621 -0.4652 -0.3004 -0.2979 -0.2047 -0.1045 -0.2072 -0.1347 -0.4279 -0.4293 0.1139 -0.0271 0.3412 -0.1865 -0.1593 -0.1284 -0.1603 -0.1664 -0.2132 0.3430 0.3789 0.4196 0.4254 -0.3237 -0.1145 -0.1288 0.1968 0.1393 0.1583 0.1640 0.1643 0.2114 0.1138 0.1059 0.1128 0.1251 0.1374 0.1208 0.1474 0.1327 0.1148 0.1139 0.1185 0.1400 0.1105 0.1947
va: 6.0094 1.9901 1.9841 1.9196 2.0386 2.1206 2.1312 3.0675 3.1394 3.0767 3.1784 2.9718 2.9770 3.7715 3.6381 4.0531 4.0725 3.8983 3.9267 3.9196 3.8958 3.8833 4.4099 4.2334 4.0183 3.9813 3.9319 3.8454 3.8377 1.0481 1.0241 0.9958 0.9881 0.9885 1.0675 0.9903 1.0065 0.9952 0.9979 0.9902 0.9912 1.0158 0.9935 0.9951 0.9956 0.9900 0.9965 0.9969 1.0155
dispcorr: -0.028552735 hartree
energy: -1800.049014664024
dipole: -1.22064 -0.68193 -1.90257 -11.23186 8.74681 -2.48505 15.34493 -12.49402 2.85091
magnitude: 4.23355 au
magnitude: 10.76082 debye
