program: Orca
programVersion: 4.2.1
elementType: S O O O O O O N N N N N N C C C C C C C C C C C C C C C C H H H H H H H H H H H H H H H H H H H H
charge: 0
multiplicity: 1
keywords: wb97x-d3
keywords: def2-TZVPP
keywords: def2/J RIJCOSX GRIDX6 NOFINALGRIDX
keywords: grid4 nofinalgrid
keywords: scfconv7
keywords: smallprint printgap noloewdin
keywords: NOSOSCF
formula: C16H20N6O6S
InChI: InChI=1S/C16H20N6O6S/c1-22(2)14(23)10-7-5-6-8-11(10)20-29(25,26)21-16(24)19-15-17-12(27-3)9-13(18-15)28-4/h5-9,19-21H,1-4H3
49 atoms
S  1.771302 0.879495 2.319964
O  2.707086 1.96324 2.490623
O  1.328932 0.126363 3.471878
O  3.813919 0.042207 -1.181362
O  1.290706 2.488271 -0.124731
O  -4.126335 -0.823662 -2.154112
O  -3.116748 -1.217212 2.356563
N  2.427247 -0.130561 1.192532
N  2.374061 0.624914 -2.806421
N  0.342792 1.412681 1.640916
N  -0.841788 1.766679 -0.329295
N  -2.504691 0.502019 -1.236953
N  -1.997546 0.302332 1.059729
C  1.595306 -0.948515 0.396315
C  1.655113 -0.877848 -1.006096
C  2.680821 -0.016836 -1.670735
C  0.695687 -1.815363 1.006793
C  0.832383 -1.718867 -1.751937
C  -0.153006 -2.599627 0.242814
C  -0.082192 -2.559984 -1.140251
C  3.428572 1.367399 -3.474204
C  1.034124 0.964905 -3.245395
C  0.333231 1.926614 0.363248
C  -1.824514 0.805003 -0.149428
C  -3.420371 -0.448264 -1.10165
C  -2.913835 -0.655018 1.177699
C  -3.675074 -1.086382 0.105659
C  -3.858965 -0.221054 -3.419009
C  -2.358925 -0.775911 3.480238
H  3.219407 0.27581 0.697758
H  0.67145 -1.900528 2.083947
H  0.905551 -1.72117 -2.831329
H  -0.854346 -3.259158 0.735709
H  -0.721357 -3.190347 -1.74235
H  -0.511529 0.914847 1.930693
H  3.122639 1.556729 -4.500726
H  4.354978 0.800299 -3.498413
H  3.616456 2.32804 -2.990371
H  0.909354 2.049081 -3.234903
H  0.85923 0.614721 -4.26242
H  0.273811 0.530197 -2.607748
H  -4.41801 -1.864156 0.203043
H  -4.069816 0.847649 -3.40901
H  -4.526531 -0.710298 -4.122518
H  -2.827952 -0.382898 -3.731985
H  -2.737243 -1.338383 4.328868
H  -2.494859 0.288553 3.669084
H  -1.297643 -0.996276 3.362781
H  -0.8223 2.171118 -1.256559
elementType: S O N C H
totalener: -1800.01732021 hartree
nucrepener: 3384.10959787 hartree
electener: -5184.12691808 hartree
oneelecener: -9196.22305966 hartree
twoeener: 4012.09614158 hartree
cpcmener: -0.05680088 hartree
kineticenergy: 1793.37642455 hartree
xcener: -149.352052112280 hartree
chargesum: 0.0000000
charge: 0.875655 -0.493317 -0.499369 -0.559498 -0.437970 -0.298635 -0.294225 -0.211210 -0.101350 -0.194963 -0.152240 -0.388726 -0.407113 0.133447 -0.033826 0.338976 -0.292425 -0.108324 -0.069807 -0.199422 -0.174470 -0.172387 0.295800 0.323613 0.412707 0.410985 -0.306267 -0.114285 -0.109834 0.213300 0.179749 0.163670 0.164337 0.159900 0.218892 0.111489 0.106783 0.117464 0.128971 0.140069 0.059481 0.144953 0.115235 0.134726 0.111831 0.140249 0.127089 0.089022 0.201266
qa: 0.8757 -0.4933 -0.4994 -0.5595 -0.4380 -0.2986 -0.2942 -0.2112 -0.1013 -0.1950 -0.1522 -0.3887 -0.4071 0.1334 -0.0338 0.3390 -0.2924 -0.1083 -0.0698 -0.1994 -0.1745 -0.1724 0.2958 0.3236 0.4127 0.4110 -0.3063 -0.1143 -0.1098 0.2133 0.1797 0.1637 0.1643 0.1599 0.2189 0.1115 0.1068 0.1175 0.1290 0.1401 0.0595 0.1450 0.1152 0.1347 0.1118 0.1402 0.1271 0.0890 0.2013
va: 6.0153 2.0020 1.9819 1.9173 2.0664 2.1208 2.1207 3.0341 3.1712 3.0571 3.1744 2.9334 2.9497 3.7721 3.5834 4.0924 4.0326 3.8505 3.8151 3.9075 3.9018 3.8839 4.4924 4.2530 4.0061 3.9637 3.9364 3.8517 3.8405 1.0444 0.9953 0.9922 0.9906 0.9916 1.0700 0.9961 1.0048 0.9912 0.9920 0.9942 1.0139 1.0163 0.9949 0.9935 0.9925 0.9958 0.9903 0.9968 1.0088
dispcorr: -0.036058636 hartree
energy: -1800.053378849331
dipole: -7.11832 2.62049 -4.49783 -3.88215 2.41456 -1.46758 -19.94114 16.21861 -3.72253
magnitude: 6.02009 au
magnitude: 15.30186 debye
