program: Orca
programVersion: 4.2.1
elementType: S O O O O O O N N N N N N C C C C C C C C C C C C C C C C H H H H H H H H H H H H H H H H H H H H
charge: 0
multiplicity: 1
keywords: wb97x-d3
keywords: def2-TZVPP
keywords: def2/J RIJCOSX GRIDX6 NOFINALGRIDX
keywords: grid4 nofinalgrid
keywords: scfconv7
keywords: smallprint printgap noloewdin
keywords: NOSOSCF
formula: C16H20N6O6S
InChI: InChI=1S/C16H20N6O6S/c1-22(2)14(23)10-7-5-6-8-11(10)20-29(25,26)21-16(24)19-15-17-12(27-3)9-13(18-15)28-4/h5-9,19-21H,1-4H3
49 atoms
S  1.794146 0.793062 2.319716
O  2.746522 1.859467 2.509168
O  1.357942 0.010876 3.454774
O  3.771023 0.075611 -1.222983
O  1.296308 2.476209 -0.073283
O  -4.085766 -0.835618 -2.137725
O  -3.116306 -1.242828 2.381211
N  2.420556 -0.187369 1.152633
N  2.31668 0.70549 -2.817621
N  0.363041 1.3648 1.678498
N  -0.845962 1.778405 -0.265239
N  -2.489168 0.50335 -1.196628
N  -2.001243 0.295442 1.10351
C  1.571032 -0.971166 0.341348
C  1.6140 -0.851692 -1.058281
C  2.634273 0.029493 -1.704936
C  0.675352 -1.85515 0.932713
C  0.779496 -1.664006 -1.822754
C  -0.182572 -2.612517 0.151733
C  -0.127755 -2.525994 -1.22988
C  3.362935 1.473089 -3.47009
C  0.972279 1.059891 -3.231378
C  0.34137 1.910616 0.413912
C  -1.822699 0.807437 -0.101133
C  -3.396336 -0.457024 -1.075531
C  -2.909682 -0.671088 1.207683
C  -3.657813 -1.102747 0.126421
C  -3.804804 -0.230066 -3.39813
C  -2.358194 -0.812684 3.509389
H  3.21551 0.219117 0.662538
H  0.662107 -1.977375 2.006463
H  0.840392 -1.630158 -2.902323
H  -0.877589 -3.289673 0.629392
H  -0.774755 -3.134765 -1.845768
H  -0.495089 0.875241 1.971548
H  3.543693 2.423018 -2.962991
H  3.052153 1.685876 -4.490538
H  4.294754 0.916059 -3.510988
H  0.847464 2.143046 -3.18313
H  0.787322 0.744248 -4.258002
H  0.217237 0.604334 -2.602077
H  -4.394447 -1.887923 0.212412
H  -2.768958 -0.387843 -3.697711
H  -4.019775 0.837866 -3.390023
H  -4.460828 -0.721054 -4.111184
H  -2.729132 -1.391196 4.350518
H  -2.500637 0.247855 3.714624
H  -1.295808 -1.023639 3.384585
H  -0.831575 2.199564 -1.185353
elementType: S O N C H
totalener: -1800.01677856 hartree
nucrepener: 3389.03271772 hartree
electener: -5189.04949629 hartree
oneelecener: -9206.08771323 hartree
twoeener: 4017.03821694 hartree
cpcmener: -0.05645013 hartree
kineticenergy: 1793.37657299 hartree
xcener: -149.352288780498 hartree
chargesum: -0.0000000
charge: 0.875510 -0.493941 -0.499444 -0.559505 -0.434981 -0.298887 -0.294076 -0.211094 -0.100036 -0.195199 -0.152744 -0.386711 -0.408140 0.135688 -0.032003 0.337264 -0.291909 -0.106200 -0.068743 -0.201030 -0.174943 -0.171508 0.293441 0.319555 0.411485 0.416012 -0.306423 -0.113959 -0.109099 0.213915 0.177420 0.163674 0.163678 0.159854 0.217357 0.117856 0.111503 0.106789 0.128575 0.140181 0.057471 0.144379 0.111008 0.115677 0.135012 0.140199 0.126617 0.088987 0.201472
qa: 0.8755 -0.4939 -0.4994 -0.5595 -0.4350 -0.2989 -0.2941 -0.2111 -0.1000 -0.1952 -0.1527 -0.3867 -0.4081 0.1357 -0.0320 0.3373 -0.2919 -0.1062 -0.0687 -0.2010 -0.1749 -0.1715 0.2934 0.3196 0.4115 0.4160 -0.3064 -0.1140 -0.1091 0.2139 0.1774 0.1637 0.1637 0.1599 0.2174 0.1179 0.1115 0.1068 0.1286 0.1402 0.0575 0.1444 0.1110 0.1157 0.1350 0.1402 0.1266 0.0890 0.2015
va: 6.0169 2.0012 1.9815 1.9171 2.0692 2.1187 2.1222 3.0341 3.1718 3.0554 3.1731 2.9308 2.9499 3.7662 3.5763 4.0922 4.0324 3.8476 3.8189 3.9072 3.9017 3.8833 4.4958 4.2549 4.0029 3.9604 3.9355 3.8519 3.8409 1.0451 0.9975 0.9924 0.9908 0.9917 1.0713 0.9912 0.9961 1.0053 0.9921 0.9945 1.0142 1.0166 0.9920 0.9947 0.9936 0.9955 0.9905 0.9969 1.0089
dispcorr: -0.036283361 hartree
energy: -1800.053061924485
dipole: -7.33445 2.80860 -4.52585 -3.28890 1.92384 -1.36506 -19.96944 16.25108 -3.71836
magnitude: 6.01439 au
magnitude: 15.28737 debye
