program: Orca
programVersion: 4.2.1
elementType: S O O O O O O N N N N N N C C C C C C C C C C C C C C C C H H H H H H H H H H H H H H H H H H H H
charge: 0
multiplicity: 1
keywords: wb97x-d3
keywords: def2-TZVPP
keywords: def2/J RIJCOSX GRIDX6 NOFINALGRIDX
keywords: grid4 nofinalgrid
keywords: scfconv7
keywords: smallprint printgap noloewdin
keywords: NOSOSCF
formula: C16H20N6O6S
InChI: InChI=1S/C16H20N6O6S/c1-22(2)14(23)10-7-5-6-8-11(10)20-29(25,26)21-16(24)19-15-17-12(27-3)9-13(18-15)28-4/h5-9,19-21H,1-4H3
49 atoms
S  1.848975 0.775328 1.870597
O  1.974986 2.155473 1.463545
O  2.160492 0.358984 3.216202
O  -0.041089 -1.131147 -1.284907
O  0.401684 -1.756264 2.159225
O  -5.501746 -0.423399 -0.873636
O  -2.533508 3.122643 -0.457483
N  2.773785 -0.136506 0.87138
N  1.520604 -2.724499 -0.885403
N  0.253479 0.424261 1.55514
N  -1.570009 -1.000522 1.361113
N  -3.523959 -0.723592 0.233066
N  -2.027006 1.08693 0.44983
C  2.913112 0.199087 -0.502929
C  2.197937 -0.467545 -1.496185
C  1.132215 -1.479083 -1.191519
C  3.816477 1.19754 -0.847044
C  2.397059 -0.118775 -2.828049
C  4.005232 1.539891 -2.175272
C  3.297849 0.877096 -3.168334
C  0.547336 -3.734656 -0.522795
C  2.899721 -3.142963 -0.750001
C  -0.254407 -0.835439 1.712388
C  -2.398758 -0.167062 0.641897
C  -4.353719 0.065663 -0.434569
C  -2.864717 1.862294 -0.229671
C  -4.079138 1.400755 -0.706416
C  -5.809357 -1.79406 -0.629145
C  -1.272936 3.599389 0.008564
H  2.838593 -1.110971 1.146433
H  4.382189 1.693971 -0.070927
H  1.846436 -0.634778 -3.60407
H  4.71247 2.315826 -2.434113
H  3.447395 1.133668 -4.208229
H  -0.343287 1.125247 1.094348
H  -0.463084 -3.363263 -0.653988
H  0.678511 -4.034778 0.517008
H  0.677419 -4.616247 -1.151317
H  3.054817 -4.071988 -1.298676
H  3.589858 -2.408698 -1.154666
H  3.155948 -3.331488 0.295163
H  -4.762872 2.032456 -1.25386
H  -5.865001 -2.011522 0.43685
H  -5.083655 -2.459012 -1.096032
H  -6.784791 -1.958821 -1.078085
H  -1.186482 3.522764 1.092355
H  -1.231831 4.647293 -0.274356
H  -0.44459 3.075253 -0.46949
H  -1.897898 -1.953349 1.447219
elementType: S O N C H
totalener: -1800.01808164 hartree
nucrepener: 3282.55796436 hartree
electener: -5082.57604601 hartree
oneelecener: -8995.42328984 hartree
twoeener: 3912.84724383 hartree
cpcmener: -0.05251093 hartree
kineticenergy: 1793.38955801 hartree
xcener: -149.352083202109 hartree
chargesum: 0.0000000
charge: 0.879176 -0.503921 -0.498966 -0.521108 -0.474905 -0.301399 -0.299089 -0.219256 -0.061960 -0.184855 -0.126136 -0.421683 -0.420792 0.177814 -0.076196 0.263546 -0.206633 -0.127099 -0.106812 -0.180714 -0.180090 -0.189002 0.326122 0.370939 0.417811 0.421091 -0.326374 -0.115335 -0.123680 0.197170 0.145168 0.149770 0.164966 0.165604 0.209954 0.105799 0.111818 0.125521 0.117076 0.132655 0.118561 0.146758 0.113708 0.114786 0.132864 0.117923 0.140457 0.107588 0.191357
qa: 0.8792 -0.5039 -0.4990 -0.5211 -0.4749 -0.3014 -0.2991 -0.2193 -0.0620 -0.1849 -0.1261 -0.4217 -0.4208 0.1778 -0.0762 0.2635 -0.2066 -0.1271 -0.1068 -0.1807 -0.1801 -0.1890 0.3261 0.3709 0.4178 0.4211 -0.3264 -0.1153 -0.1237 0.1972 0.1452 0.1498 0.1650 0.1656 0.2100 0.1058 0.1118 0.1255 0.1171 0.1327 0.1186 0.1468 0.1137 0.1148 0.1329 0.1179 0.1405 0.1076 0.1914
va: 6.0371 1.9865 1.9937 1.9684 2.0310 2.1187 2.1283 3.0474 3.1653 3.0708 3.1892 2.9552 2.9664 3.6618 3.7944 4.1513 4.0953 3.9249 3.8886 3.9186 3.8574 3.8926 4.4615 4.2306 4.0196 3.9881 3.9301 3.8460 3.8409 1.0232 1.0182 1.0032 0.9871 0.9879 1.0738 1.0241 0.9996 0.9986 0.9968 0.9901 0.9867 1.0159 0.9956 0.9954 0.9934 0.9907 0.9957 0.9951 1.0166
dispcorr: -0.031426332 hartree
energy: -1800.049507976232
dipole: 0.48923 -0.59226 -0.10303 -11.40306 9.66635 -1.73671 -12.23097 9.58537 -2.64560
magnitude: 3.16638 au
magnitude: 8.04830 debye
