program: Orca
programVersion: 4.2.1
elementType: S O O O O O O N N N N N N C C C C C C C C C C C C C C C C H H H H H H H H H H H H H H H H H H H H
charge: 0
multiplicity: 1
keywords: wb97x-d3
keywords: def2-TZVPP
keywords: def2/J RIJCOSX GRIDX6 NOFINALGRIDX
keywords: grid4 nofinalgrid
keywords: scfconv7
keywords: smallprint printgap noloewdin
keywords: NOSOSCF
formula: C16H20N6O6S
InChI: InChI=1S/C16H20N6O6S/c1-22(2)14(23)10-7-5-6-8-11(10)20-29(25,26)21-16(24)19-15-17-12(27-3)9-13(18-15)28-4/h5-9,19-21H,1-4H3
49 atoms
S  1.842024 0.781052 1.870578
O  1.956928 2.163198 1.466221
O  2.153534 0.364323 3.216242
O  -0.024264 -1.162769 -1.283157
O  0.402168 -1.760525 2.152159
O  -5.517093 -0.43078 -0.855707
O  -2.543418 3.113158 -0.464687
N  2.775532 -0.121207 0.872307
N  1.559627 -2.728919 -0.86304
N  0.249248 0.420501 1.549825
N  -1.570726 -1.00828 1.353142
N  -3.531635 -0.731856 0.237149
N  -2.032464 1.0784 0.442223
C  2.911822 0.211448 -0.503081
C  2.205641 -0.468544 -1.49359
C  1.153736 -1.492943 -1.183777
C  3.800362 1.221971 -0.850697
C  2.400629 -0.122796 -2.826764
C  3.983674 1.562446 -2.180258
C  3.287295 0.884407 -3.170899
C  0.601534 -3.751482 -0.495637
C  2.944552 -3.128793 -0.731433
C  -0.254992 -0.840819 1.705398
C  -2.403296 -0.175388 0.638032
C  -4.365417 0.05732 -0.42518
C  -2.874116 1.853293 -0.233069
C  -4.091861 1.391846 -0.700888
C  -5.826382 -1.800297 -0.606736
C  -1.280124 3.589764 -0.005922
H  2.863234 -1.091962 1.153753
H  4.358895 1.730318 -0.077067
H  1.857636 -0.649389 -3.601021
H  4.679208 2.347948 -2.442088
H  3.433806 1.138942 -4.211742
H  -0.348918 1.120371 1.089382
H  -0.413563 -3.380321 -0.582168
H  0.768964 -4.076424 0.531146
H  0.711568 -4.617273 -1.149482
H  3.210836 -3.298807 0.314484
H  3.106777 -4.064119 -1.267325
H  3.6226 -2.392516 -1.152289
H  -4.778942 2.023199 -1.244503
H  -5.105846 -2.468174 -1.077454
H  -6.805301 -1.963205 -1.048667
H  -5.875294 -2.015891 0.459957
H  -1.189352 3.517086 1.077813
H  -1.238817 4.636567 -0.292779
H  -0.454531 3.062755 -0.485477
H  -1.898885 -1.960375 1.444099
elementType: S O N C H
totalener: -1800.01784790 hartree
nucrepener: 3281.00578822 hartree
electener: -5081.02363613 hartree
oneelecener: -8992.32046449 hartree
twoeener: 3911.29682836 hartree
cpcmener: -0.05225815 hartree
kineticenergy: 1793.38565458 hartree
xcener: -149.351515343895 hartree
chargesum: -0.0000000
charge: 0.879586 -0.504555 -0.499011 -0.519890 -0.471637 -0.301476 -0.299226 -0.219397 -0.059960 -0.184274 -0.125521 -0.422021 -0.420689 0.178662 -0.075768 0.260528 -0.205807 -0.126656 -0.106880 -0.180672 -0.180932 -0.189272 0.322316 0.371802 0.417501 0.420858 -0.326530 -0.115309 -0.123689 0.198043 0.143834 0.149557 0.164972 0.165544 0.209963 0.105029 0.111622 0.127058 0.118209 0.116936 0.132656 0.146772 0.114694 0.132871 0.113697 0.117743 0.140396 0.107716 0.190606
qa: 0.8796 -0.5046 -0.4990 -0.5199 -0.4716 -0.3015 -0.2992 -0.2194 -0.0600 -0.1843 -0.1255 -0.4220 -0.4207 0.1787 -0.0758 0.2605 -0.2058 -0.1267 -0.1069 -0.1807 -0.1809 -0.1893 0.3223 0.3718 0.4175 0.4209 -0.3265 -0.1153 -0.1237 0.1980 0.1438 0.1496 0.1650 0.1655 0.2100 0.1050 0.1116 0.1271 0.1182 0.1169 0.1327 0.1468 0.1147 0.1329 0.1137 0.1177 0.1404 0.1077 0.1906
va: 6.0367 1.9858 1.9936 1.9696 2.0362 2.1186 2.1281 3.0487 3.1615 3.0690 3.1880 2.9566 2.9668 3.6612 3.7928 4.1555 4.0956 3.9238 3.8897 3.9183 3.8602 3.8936 4.4678 4.2304 4.0203 3.9881 3.9297 3.8461 3.8411 1.0223 1.0189 1.0033 0.9872 0.9880 1.0737 1.0243 0.9987 0.9981 0.9868 0.9965 0.9901 1.0159 0.9954 0.9934 0.9956 0.9908 0.9957 0.9949 1.0172
dispcorr: -0.031381922 hartree
energy: -1800.049229823876
dipole: 0.66238 -0.71390 -0.05151 -11.36090 9.64453 -1.71637 -12.12945 9.50518 -2.62427
magnitude: 3.13614 au
magnitude: 7.97144 debye
