program: Orca
programVersion: 4.2.1
elementType: S O O O O O O N N N N N N C C C C C C C C C C C C C C C C H H H H H H H H H H H H H H H H H H H H
charge: 0
multiplicity: 1
keywords: wb97x-d3
keywords: def2-TZVPP
keywords: def2/J RIJCOSX GRIDX6 NOFINALGRIDX
keywords: grid4 nofinalgrid
keywords: scfconv7
keywords: smallprint printgap noloewdin
keywords: NOSOSCF
formula: C16H20N6O6S
InChI: InChI=1S/C16H20N6O6S/c1-22(2)14(23)10-7-5-6-8-11(10)20-29(25,26)21-16(24)19-15-17-12(27-3)9-13(18-15)28-4/h5-9,19-21H,1-4H3
49 atoms
S  1.538462 0.789487 2.116804
O  1.961941 2.139658 2.392042
O  1.266605 -0.118926 3.208038
O  4.242412 0.925177 -1.048276
O  0.840189 1.996617 -0.507795
O  -5.602059 -0.034862 -1.264439
O  -3.384137 -1.496389 2.541633
N  2.667556 0.160608 1.105877
N  2.899461 0.860815 -2.855623
N  0.11817 0.759684 1.255845
N  -1.278331 1.208832 -0.537359
N  -3.436527 0.589088 -0.904447
N  -2.318972 -0.152931 1.033641
C  2.396898 -0.929811 0.258136
C  2.678794 -0.834275 -1.112827
C  3.316788 0.39852 -1.668314
C  1.854317 -2.103291 0.771925
C  2.468934 -1.947763 -1.92182
C  1.610979 -3.182556 -0.061128
C  1.932924 -3.116246 -1.40793
C  3.620126 1.960673 -3.464505
C  1.606837 0.584656 -3.449079
C  -0.039043 1.369027 0.041256
C  -2.388782 0.514272 -0.106013
C  -4.517612 -0.071034 -0.51332
C  -3.408606 -0.813414 1.41292
C  -4.572034 -0.810627 0.66302
C  -5.579812 0.718973 -2.473117
C  -2.183672 -1.519609 3.309651
H  3.297224 0.85998 0.717952
H  1.648997 -2.191542 1.829428
H  2.732422 -1.90293 -2.970829
H  1.190146 -4.088289 0.354895
H  1.773413 -3.968808 -2.053937
H  -0.678947 0.220058 1.623392
H  3.485095 1.91471 -4.544605
H  4.684433 1.897921 -3.254479
H  3.251124 2.927917 -3.113897
H  1.0714 1.523431 -3.60071
H  1.713651 0.095469 -4.418531
H  0.991647 -0.04213 -2.812598
H  -5.458888 -1.345325 0.970451
H  -5.393197 1.776604 -2.286207
H  -6.568761 0.602321 -2.90869
H  -4.833571 0.340536 -3.171854
H  -2.399217 -2.142233 4.173831
H  -1.905182 -0.523647 3.655993
H  -1.35865 -1.965707 2.753067
H  -1.392466 1.688053 -1.420714
elementType: S O N C H
totalener: -1800.02549087 hartree
nucrepener: 3226.43380919 hartree
electener: -5026.45930006 hartree
oneelecener: -8881.51203132 hartree
twoeener: 3855.05273127 hartree
cpcmener: -0.04470742 hartree
kineticenergy: 1793.39031654 hartree
xcener: -149.354056050240 hartree
chargesum: -0.0000000
charge: 0.869552 -0.486985 -0.495449 -0.532455 -0.441748 -0.290627 -0.289457 -0.191809 -0.097782 -0.195498 -0.132984 -0.427867 -0.429088 0.032328 -0.013633 0.348800 -0.205281 -0.154223 -0.119115 -0.164760 -0.177989 -0.200299 0.330067 0.376604 0.413554 0.418504 -0.321964 -0.115515 -0.118718 0.208572 0.165493 0.155134 0.161370 0.161208 0.210754 0.109788 0.106222 0.117376 0.118445 0.131232 0.115273 0.145907 0.113612 0.131523 0.112868 0.138393 0.113485 0.106591 0.190589
qa: 0.8696 -0.4870 -0.4954 -0.5325 -0.4417 -0.2906 -0.2895 -0.1918 -0.0978 -0.1955 -0.1330 -0.4279 -0.4291 0.0323 -0.0136 0.3488 -0.2053 -0.1542 -0.1191 -0.1648 -0.1780 -0.2003 0.3301 0.3766 0.4136 0.4185 -0.3220 -0.1155 -0.1187 0.2086 0.1655 0.1551 0.1614 0.1612 0.2108 0.1098 0.1062 0.1174 0.1184 0.1312 0.1153 0.1459 0.1136 0.1315 0.1129 0.1384 0.1135 0.1066 0.1906
va: 6.0389 2.0112 1.9862 1.9533 2.0762 2.1316 2.1424 3.0580 3.1278 3.0553 3.1789 2.9679 2.9766 3.9006 3.5891 4.0735 4.0276 3.9160 3.9415 3.9337 3.8995 3.8977 4.4345 4.2368 4.0267 3.9947 3.9271 3.8493 3.8511 1.0480 1.0131 0.9965 0.9893 0.9894 1.0720 0.9938 1.0100 0.9898 0.9950 0.9900 0.9919 1.0161 0.9957 0.9936 0.9957 0.9959 0.9929 0.9920 1.0173
dispcorr: -0.029350042 hartree
energy: -1800.054840909313
dipole: -3.99923 0.47017 -3.52906 -4.27736 2.33040 -1.94696 -19.33111 15.93849 -3.39263
magnitude: 5.26829 au
magnitude: 13.39093 debye
