program: Orca
programVersion: 4.2.1
elementType: S O O O O O O N N N N N N C C C C C C C C C C C C C C C C H H H H H H H H H H H H H H H H H H H H
charge: 0
multiplicity: 1
keywords: wb97x-d3
keywords: def2-TZVPP
keywords: def2/J RIJCOSX GRIDX6 NOFINALGRIDX
keywords: grid4 nofinalgrid
keywords: scfconv7
keywords: smallprint printgap noloewdin
keywords: NOSOSCF
formula: C16H20N6O6S
InChI: InChI=1S/C16H20N6O6S/c1-22(2)14(23)10-7-5-6-8-11(10)20-29(25,26)21-16(24)19-15-17-12(27-3)9-13(18-15)28-4/h5-9,19-21H,1-4H3
49 atoms
S  1.41548 0.790096 1.914585
O  1.551568 2.20997 2.133531
O  1.23225 -0.104765 3.03486
O  4.12482 1.290352 -1.177103
O  0.708393 1.699618 -0.834315
O  -5.934955 0.340492 -0.916908
O  -3.539502 -1.235064 2.732494
N  2.722939 0.355065 1.0358
N  2.920254 0.629894 -2.962177
N  0.087169 0.459656 0.965975
N  -1.425772 0.969067 -0.718936
N  -3.674786 0.64537 -0.826783
N  -2.463683 -0.162987 1.027192
C  2.819839 -0.861544 0.332265
C  3.143001 -0.845638 -1.032027
C  3.413478 0.449629 -1.729359
C  2.634141 -2.074913 0.985858
C  3.337571 -2.055353 -1.692672
C  2.794794 -3.266827 0.298341
C  3.164134 -3.263069 -1.038054
C  3.282326 1.835906 -3.678706
C  1.787586 -0.086661 -3.513065
C  -0.145803 1.091132 -0.227399
C  -2.566025 0.455669 -0.136764
C  -4.789138 0.177172 -0.282433
C  -3.589352 -0.622655 1.56491
C  -4.817587 -0.48076 0.942133
C  -5.94128 1.030061 -2.163543
C  -2.283495 -1.361254 3.394916
H  3.178032 1.144006 0.579956
H  2.397497 -2.095686 2.039888
H  3.637027 -2.053599 -2.733016
H  2.656708 -4.203138 0.822513
H  3.323582 -4.192984 -1.566758
H  -0.713013 -0.012073 1.410792
H  2.652183 2.680124 -3.387683
H  3.153177 1.663357 -4.746115
H  4.321542 2.101265 -3.503809
H  1.365631 -0.789541 -2.802648
H  1.002503 0.624955 -3.774026
H  2.065215 -0.631296 -4.416846
H  -5.733285 -0.851448 1.37922
H  -6.980598 1.05089 -2.481109
H  -5.347429 0.510547 -2.915716
H  -5.577431 2.052656 -2.061757
H  -1.857802 -0.387549 3.640764
H  -1.572161 -1.942176 2.806657
H  -2.49155 -1.894482 4.31873
H  -1.574533 1.425463 -1.609262
elementType: S O N C H
totalener: -1800.02606274 hartree
nucrepener: 3184.48278237 hartree
electener: -4984.50884511 hartree
oneelecener: -8797.98168958 hartree
twoeener: 3813.47284447 hartree
cpcmener: -0.04395054 hartree
kineticenergy: 1793.38651249 hartree
xcener: -149.351502637667 hartree
chargesum: 0.0000000
charge: 0.875709 -0.489510 -0.499555 -0.533368 -0.447207 -0.291140 -0.289338 -0.193480 -0.095272 -0.198715 -0.138924 -0.426123 -0.431692 0.031393 -0.009232 0.346199 -0.185631 -0.154697 -0.118626 -0.168132 -0.177015 -0.205431 0.350102 0.372819 0.415626 0.422456 -0.324619 -0.116625 -0.126632 0.208234 0.157442 0.155163 0.161338 0.160467 0.206056 0.114270 0.109769 0.106112 0.121238 0.116193 0.133336 0.145403 0.131691 0.113467 0.113519 0.112492 0.113578 0.138099 0.188796
qa: 0.8757 -0.4895 -0.4996 -0.5334 -0.4472 -0.2911 -0.2893 -0.1935 -0.0953 -0.1987 -0.1389 -0.4261 -0.4317 0.0314 -0.0092 0.3462 -0.1856 -0.1547 -0.1186 -0.1681 -0.1770 -0.2054 0.3501 0.3728 0.4156 0.4225 -0.3246 -0.1166 -0.1266 0.2082 0.1574 0.1552 0.1613 0.1605 0.2061 0.1143 0.1098 0.1061 0.1212 0.1162 0.1333 0.1454 0.1317 0.1135 0.1135 0.1125 0.1136 0.1381 0.1888
va: 6.0282 2.0073 1.9831 1.9550 2.0710 2.1310 2.1410 3.0569 3.1215 3.0558 3.1705 2.9663 2.9743 3.9156 3.5966 4.0633 4.0502 3.9130 3.9316 3.9341 3.9011 3.8990 4.4212 4.2478 4.0235 3.9890 3.9273 3.8493 3.8450 1.0493 1.0188 0.9981 0.9887 0.9901 1.0720 0.9925 0.9939 1.0085 0.9897 0.9949 0.9888 1.0163 0.9934 0.9954 0.9959 0.9964 0.9908 0.9962 1.0188
dispcorr: -0.028190184 hartree
energy: -1800.054252925893
dipole: -2.70215 -0.30213 -3.00428 -5.76879 3.32804 -2.44075 -18.04995 14.99829 -3.05166
magnitude: 4.92905 au
magnitude: 12.52866 debye
