program: Orca
programVersion: 4.2.1
elementType: S O O O O O O N N N N N N C C C C C C C C C C C C C C C C H H H H H H H H H H H H H H H H H H H H
charge: 0
multiplicity: 1
keywords: wb97x-d3
keywords: def2-TZVPP
keywords: def2/J RIJCOSX GRIDX6 NOFINALGRIDX
keywords: grid4 nofinalgrid
keywords: scfconv7
keywords: smallprint printgap noloewdin
keywords: NOSOSCF
formula: C16H20N6O6S
InChI: InChI=1S/C16H20N6O6S/c1-22(2)14(23)10-7-5-6-8-11(10)20-29(25,26)21-16(24)19-15-17-12(27-3)9-13(18-15)28-4/h5-9,19-21H,1-4H3
49 atoms
S  1.490502 1.0023 1.934007
O  1.732734 2.418534 2.060499
O  1.268489 0.199518 3.115116
O  4.18217 1.110147 -1.218287
O  0.805919 1.789219 -0.850999
O  -5.746826 0.030426 -1.138796
O  -3.462161 -1.04936 2.75592
N  2.742172 0.411356 1.058817
N  2.872328 0.529999 -2.955476
N  0.132893 0.697601 1.025313
N  -1.311037 1.004916 -0.761571
N  -3.523168 0.509134 -0.958623
N  -2.371103 -0.043733 1.021451
C  2.684473 -0.829589 0.393474
C  2.973454 -0.896631 -0.977271
C  3.37093 0.334619 -1.726572
C  2.363631 -1.989786 1.090243
C  3.003273 -2.141687 -1.599253
C  2.357574 -3.212996 0.440425
C  2.695908 -3.297348 -0.9015
C  3.348582 1.670612 -3.711853
C  1.650484 -0.064959 -3.458868
C  -0.058644 1.211471 -0.228394
C  -2.446579 0.462236 -0.197684
C  -4.632556 0.009257 -0.432143
C  -3.490262 -0.540072 1.539043
C  -4.687336 -0.540878 0.843968
C  -5.72058 0.585981 -2.450681
C  -2.23229 -1.048704 3.477028
H  3.257073 1.133771 0.558641
H  2.146608 -1.947713 2.147984
H  3.275313 -2.209251 -2.644987
H  2.111934 -4.107155 0.997739
H  2.725779 -4.255696 -1.40186
H  -0.677755 0.250182 1.479022
H  3.143974 1.502073 -4.76784
H  4.421148 1.801674 -3.594007
H  2.848024 2.59331 -3.407401
H  0.934935 0.72302 -3.7000
H  1.838115 -0.641088 -4.366138
H  1.183855 -0.717052 -2.728403
H  -5.598966 -0.940512 1.26362
H  -5.426966 1.635717 -2.440003
H  -6.738009 0.503248 -2.823817
H  -5.051019 0.032693 -3.109443
H  -2.454239 -1.506632 4.437246
H  -1.864619 -0.036373 3.648827
H  -1.468846 -1.642977 2.973181
H  -1.43663 1.382256 -1.691603
elementType: S O N C H
totalener: -1800.02591551 hartree
nucrepener: 3206.99435887 hartree
electener: -5007.02027438 hartree
oneelecener: -8842.80746234 hartree
twoeener: 3835.78718796 hartree
cpcmener: -0.04437168 hartree
kineticenergy: 1793.39734783 hartree
xcener: -149.354494807511 hartree
chargesum: 0.0000000
charge: 0.871112 -0.488604 -0.496983 -0.532672 -0.447522 -0.290840 -0.289086 -0.194330 -0.098423 -0.191226 -0.136443 -0.426644 -0.428987 0.024614 -0.009428 0.352388 -0.190105 -0.155644 -0.117824 -0.167187 -0.175524 -0.208388 0.345261 0.373500 0.414907 0.419739 -0.322734 -0.116264 -0.123862 0.207900 0.159826 0.154504 0.161518 0.160580 0.204544 0.108776 0.106116 0.114586 0.116755 0.133564 0.121605 0.145608 0.113165 0.132034 0.113282 0.138717 0.111662 0.112463 0.189997
qa: 0.8711 -0.4886 -0.4970 -0.5327 -0.4475 -0.2908 -0.2891 -0.1943 -0.0984 -0.1912 -0.1364 -0.4266 -0.4290 0.0246 -0.0094 0.3524 -0.1901 -0.1556 -0.1178 -0.1672 -0.1755 -0.2084 0.3453 0.3735 0.4149 0.4197 -0.3227 -0.1163 -0.1239 0.2079 0.1598 0.1545 0.1615 0.1606 0.2045 0.1088 0.1061 0.1146 0.1168 0.1336 0.1216 0.1456 0.1132 0.1320 0.1133 0.1387 0.1117 0.1125 0.1900
va: 6.0306 2.0085 1.9852 1.9551 2.0709 2.1317 2.1426 3.0558 3.1178 3.0553 3.1750 2.9671 2.9780 3.9171 3.5823 4.0631 4.0396 3.9150 3.9322 3.9339 3.9020 3.8990 4.4211 4.2445 4.0243 3.9932 3.9286 3.8494 3.8468 1.0494 1.0175 0.9982 0.9888 0.9897 1.0754 0.9944 1.0070 0.9925 0.9945 0.9903 0.9898 1.0162 0.9958 0.9934 0.9956 0.9956 0.9953 0.9916 1.0176
dispcorr: -0.028827267 hartree
energy: -1800.054742772283
dipole: -3.57627 0.28167 -3.29460 -6.77452 4.21682 -2.55770 -18.03989 15.05044 -2.98945
magnitude: 5.13157 au
magnitude: 13.04342 debye
