program: Orca
programVersion: 4.2.1
elementType: S O O O O O O N N N N N N C C C C C C C C C C C C C C C C H H H H H H H H H H H H H H H H H H H H
charge: 0
multiplicity: 1
keywords: wb97x-d3
keywords: def2-TZVPP
keywords: def2/J RIJCOSX GRIDX6 NOFINALGRIDX
keywords: grid4 nofinalgrid
keywords: scfconv7
keywords: smallprint printgap noloewdin
keywords: NOSOSCF
formula: C16H20N6O6S
InChI: InChI=1S/C16H20N6O6S/c1-22(2)14(23)10-7-5-6-8-11(10)20-29(25,26)21-16(24)19-15-17-12(27-3)9-13(18-15)28-4/h5-9,19-21H,1-4H3
49 atoms
S  1.062564 1.134247 -1.785975
O  1.02094 0.334179 -2.985246
O  0.882927 2.567578 -1.831473
O  3.112412 0.624943 1.668797
O  0.366623 -1.549975 -0.703811
O  -5.947952 -0.472567 1.515799
O  -3.556607 3.274781 0.180702
N  2.481673 0.854398 -1.02769
N  2.471167 -1.446741 2.26892
N  -0.162771 0.654852 -0.755437
N  -1.632478 -0.912019 0.127547
N  -3.783001 -0.693226 0.829728
N  -2.573695 1.213548 0.149326
C  3.212954 -0.353282 -1.091401
C  3.484848 -1.072711 0.078552
C  2.993386 -0.572079 1.397959
C  3.732072 -0.782957 -2.305798
C  4.314526 -2.187549 0.00764
C  4.520404 -1.920935 -2.362938
C  4.826187 -2.619377 -1.204845
C  2.1346 -0.984454 3.601287
C  1.995573 -2.777281 1.945121
C  -0.41853 -0.657522 -0.469926
C  -2.704295 -0.082529 0.376092
C  -4.833573 0.077662 1.070763
C  -3.635507 1.975094 0.394539
C  -4.826421 1.4536 0.871306
C  -5.993612 -1.884785 1.698979
C  -2.344286 3.819472 -0.334666
H  2.578241 1.357089 -0.146736
H  3.5466 -0.214813 -3.205798
H  4.57038 -2.724793 0.911913
H  4.919263 -2.2435 -3.315522
H  5.467807 -3.489346 -1.241697
H  -0.893831 1.342415 -0.528569
H  1.129787 -0.556269 3.638798
H  2.842949 -0.237285 3.949234
H  2.170644 -1.83024 4.286554
H  2.029558 -2.971555 0.879684
H  2.577181 -3.541242 2.463526
H  0.955303 -2.872505 2.261236
H  -5.689841 2.071923 1.06887
H  -7.002244 -2.103022 2.040287
H  -5.280444 -2.218088 2.453095
H  -5.807329 -2.419689 0.767509
H  -1.504978 3.652258 0.341271
H  -2.517059 4.888931 -0.421557
H  -2.111631 3.420331 -1.322665
H  -1.795165 -1.88872 0.334931
elementType: S O N C H
totalener: -1800.02335047 hartree
nucrepener: 3169.59499947 hartree
electener: -4969.61834994 hartree
oneelecener: -8768.72301836 hartree
twoeener: 3799.10466842 hartree
cpcmener: -0.04264590 hartree
kineticenergy: 1793.38723113 hartree
xcener: -149.351445155544 hartree
chargesum: -0.0000000
charge: 0.891754 -0.477538 -0.507451 -0.535233 -0.451974 -0.292106 -0.289682 -0.202150 -0.104635 -0.213150 -0.140375 -0.428224 -0.433869 0.120057 -0.029706 0.328031 -0.178519 -0.158167 -0.128945 -0.160256 -0.171455 -0.204735 0.353046 0.376645 0.414358 0.421434 -0.324808 -0.115639 -0.127536 0.194357 0.136333 0.153966 0.159815 0.159932 0.209014 0.113733 0.106397 0.110485 0.122923 0.131660 0.116174 0.144505 0.131456 0.112892 0.113080 0.116487 0.138023 0.111133 0.188463
qa: 0.8918 -0.4775 -0.5075 -0.5352 -0.4520 -0.2921 -0.2897 -0.2021 -0.1046 -0.2131 -0.1404 -0.4282 -0.4339 0.1201 -0.0297 0.3280 -0.1785 -0.1582 -0.1289 -0.1603 -0.1715 -0.2047 0.3530 0.3766 0.4144 0.4214 -0.3248 -0.1156 -0.1275 0.1944 0.1363 0.1540 0.1598 0.1599 0.2090 0.1137 0.1064 0.1105 0.1229 0.1317 0.1162 0.1445 0.1315 0.1129 0.1131 0.1165 0.1380 0.1111 0.1885
va: 6.0300 2.0016 1.9915 1.9538 2.0585 2.1300 2.1396 3.0747 3.1312 3.0813 3.1749 2.9665 2.9731 3.8020 3.6262 4.0795 4.0761 3.8971 3.9362 3.9258 3.8973 3.8880 4.4103 4.2414 4.0256 3.9911 3.9298 3.8499 3.8421 1.0507 1.0256 0.9964 0.9895 0.9902 1.0632 0.9895 1.0092 0.9944 0.9992 0.9888 0.9925 1.0166 0.9937 0.9955 0.9960 0.9906 0.9959 0.9971 1.0200
dispcorr: -0.027737625 hartree
energy: -1800.051088090433
dipole: 0.01682 -1.71142 -1.69460 -11.43582 9.16765 -2.26817 14.74604 -12.24329 2.50275
magnitude: 3.77890 au
magnitude: 9.60519 debye
