program: Orca
programVersion: 4.2.1
elementType: S O O O O O O N N N N N N C C C C C C C C C C C C C C C C H H H H H H H H H H H H H H H H H H H H
charge: 0
multiplicity: 1
keywords: wb97x-d3
keywords: def2-TZVPP
keywords: def2/J RIJCOSX GRIDX6 NOFINALGRIDX
keywords: grid4 nofinalgrid
keywords: scfconv7
keywords: smallprint printgap noloewdin
keywords: NOSOSCF
formula: C16H20N6O6S
InChI: InChI=1S/C16H20N6O6S/c1-22(2)14(23)10-7-5-6-8-11(10)20-29(25,26)21-16(24)19-15-17-12(27-3)9-13(18-15)28-4/h5-9,19-21H,1-4H3
49 atoms
S  1.476099 0.176744 2.01427
O  1.343361 1.429791 2.721639
O  1.719505 -1.061493 2.709499
O  2.455771 1.411238 -1.683789
O  0.411201 -1.903345 0.154965
O  -5.943309 0.248896 -0.865433
O  -3.234293 2.956929 1.755458
N  2.658574 0.388546 0.904522
N  1.543327 -0.249016 -2.900974
N  0.02563 0.079199 1.191004
N  -1.618248 -0.946172 -0.085206
N  -3.775359 -0.349225 -0.479817
N  -2.402959 1.031691 0.850935
C  3.311671 -0.658337 0.212613
C  3.194532 -0.767637 -1.178137
C  2.355725 0.209321 -1.937593
C  4.136381 -1.530066 0.911124
C  3.95579 -1.722414 -1.845378
C  4.854938 -2.501951 0.233812
C  4.779222 -2.590938 -1.147984
C  0.830155 0.701744 -3.730497
C  1.144404 -1.630269 -3.085271
C  -0.335276 -0.985694 0.415563
C  -2.636909 -0.03951 0.112113
C  -4.775895 0.50164 -0.303505
C  -3.415984 1.875762 1.021472
C  -4.661173 1.661283 0.455083
C  -6.09259 -0.936777 -1.641184
C  -1.959784 3.183107 2.352385
H  2.543571 1.240334 0.357463
H  4.241635 -1.431239 1.982169
H  3.911268 -1.786843 -2.925097
H  5.496443 -3.173448 0.788859
H  5.364234 -3.326831 -1.682966
H  -0.676901 0.812761 1.354811
H  1.395171 1.621198 -3.852899
H  -0.147608 0.947592 -3.308746
H  0.675336 0.26414 -4.715938
H  1.492397 -2.26507 -2.279051
H  0.054762 -1.689025 -3.102192
H  1.51607 -2.024619 -4.032585
H  -5.485103 2.345829 0.594356
H  -5.91886 -1.833751 -1.046468
H  -5.425087 -0.942803 -2.503075
H  -7.122845 -0.931995 -1.987558
H  -1.176206 3.294926 1.602119
H  -1.695342 2.390062 3.052767
H  -2.054378 4.116701 2.900708
H  -1.867581 -1.747596 -0.649758
elementType: S O N C H
totalener: -1800.02334218 hartree
nucrepener: 3195.50650809 hartree
electener: -4995.52985027 hartree
oneelecener: -8820.34735317 hartree
twoeener: 3824.81750290 hartree
cpcmener: -0.04333326 hartree
kineticenergy: 1793.38827257 hartree
xcener: -149.351535283219 hartree
chargesum: 0.0000000
charge: 0.889653 -0.507206 -0.474811 -0.532583 -0.445284 -0.291381 -0.288871 -0.203377 -0.103615 -0.203896 -0.136742 -0.428552 -0.432819 0.121064 -0.026627 0.316703 -0.180538 -0.156555 -0.126282 -0.162244 -0.170105 -0.209576 0.329467 0.377116 0.410254 0.416924 -0.318852 -0.116905 -0.128317 0.194972 0.137063 0.154664 0.159920 0.160675 0.212341 0.107755 0.111489 0.111900 0.126741 0.115056 0.131780 0.145505 0.113364 0.113234 0.131620 0.114849 0.113119 0.137921 0.189985
qa: 0.8897 -0.5072 -0.4748 -0.5326 -0.4453 -0.2914 -0.2889 -0.2034 -0.1036 -0.2039 -0.1367 -0.4286 -0.4328 0.1211 -0.0266 0.3167 -0.1805 -0.1566 -0.1263 -0.1622 -0.1701 -0.2096 0.3295 0.3771 0.4103 0.4169 -0.3189 -0.1169 -0.1283 0.1950 0.1371 0.1547 0.1599 0.1607 0.2123 0.1078 0.1115 0.1119 0.1267 0.1151 0.1318 0.1455 0.1134 0.1132 0.1316 0.1148 0.1131 0.1379 0.1900
va: 6.0307 1.9920 2.0078 1.9565 2.0637 2.1307 2.1408 3.0702 3.1263 3.0774 3.1709 2.9672 2.9728 3.7889 3.6324 4.0839 4.0856 3.8959 3.9357 3.9268 3.8941 3.8880 4.4252 4.2323 4.0292 3.9970 3.9264 3.8503 3.8427 1.0487 1.0243 0.9960 0.9893 0.9899 1.0617 1.0127 0.9894 0.9938 0.9972 0.9929 0.9906 1.0162 0.9957 0.9954 0.9935 0.9919 0.9949 0.9963 1.0190
dispcorr: -0.028508814 hartree
energy: -1800.051850992855
dipole: -4.54240 2.27180 -2.27060 -3.26350 2.38790 -0.87560 -18.43615 15.39307 -3.04309
magnitude: 3.89650 au
magnitude: 9.90411 debye
