program: Orca
programVersion: 4.2.1
elementType: S O O O O O O N N N N N N C C C C C C C C C C C C C C C C H H H H H H H H H H H H H H H H H H H H
charge: 0
multiplicity: 1
keywords: wb97x-d3
keywords: def2-TZVPP
keywords: def2/J RIJCOSX GRIDX6 NOFINALGRIDX
keywords: grid4 nofinalgrid
keywords: scfconv7
keywords: smallprint printgap noloewdin
keywords: NOSOSCF
formula: C16H20N6O6S
InChI: InChI=1S/C16H20N6O6S/c1-22(2)14(23)10-7-5-6-8-11(10)20-29(25,26)21-16(24)19-15-17-12(27-3)9-13(18-15)28-4/h5-9,19-21H,1-4H3
49 atoms
S  1.80565 0.869008 1.805924
O  1.897059 2.238861 1.359329
O  2.10114 0.495867 3.166032
O  0.066805 -1.35362 -1.260828
O  0.405731 -1.700334 2.125136
O  -5.587862 -0.457593 -0.779741
O  -2.656963 3.128498 -0.448728
N  2.779669 -0.0461 0.853333
N  1.735128 -2.790897 -0.727717
N  0.232488 0.458576 1.454481
N  -1.575303 -0.989647 1.306771
N  -3.580443 -0.725196 0.27018
N  -2.090325 1.095551 0.421578
C  2.908624 0.228431 -0.533679
C  2.24955 -0.536323 -1.495194
C  1.258651 -1.60498 -1.136718
C  3.737264 1.27389 -0.925133
C  2.424999 -0.235461 -2.841843
C  3.903741 1.566268 -2.268192
C  3.249686 0.807967 -3.229029
C  0.833456 -3.853104 -0.336685
C  3.138223 -3.126442 -0.632034
C  -0.260779 -0.800165 1.658147
C  -2.444494 -0.160722 0.635596
C  -4.438778 0.051436 -0.374144
C  -2.963857 1.865192 -0.218243
C  -4.18987 1.390648 -0.653105
C  -5.845304 -1.839779 -0.549817
C  -1.398874 3.626117 -0.000806
H  2.87323 -1.004197 1.172851
H  4.261222 1.84744 -0.172799
H  1.913361 -0.824572 -3.592476
H  4.551556 2.380625 -2.563643
H  3.38117 1.027535 -4.280187
H  -0.383332 1.149076 1.004994
H  0.990889 -4.729555 -0.968304
H  -0.199919 -3.537849 -0.435181
H  1.013436 -4.142062 0.699454
H  3.336462 -4.048349 -1.181231
H  3.772542 -2.353903 -1.05708
H  3.434703 -3.290363 0.406747
H  -4.899137 2.015198 -1.17624
H  -6.823419 -2.031643 -0.983318
H  -5.872154 -2.075796 0.514083
H  -5.10586 -2.4741 -1.039204
H  -1.385392 4.678452 -0.272043
H  -0.566591 3.126242 -0.498579
H  -1.290801 3.54051 1.081049
H  -1.903026 -1.938057 1.428638
elementType: S O N C H
totalener: -1800.02046897 hartree
nucrepener: 3268.90801393 hartree
electener: -5068.92848291 hartree
oneelecener: -8967.94020628 hartree
twoeener: 3899.01172337 hartree
cpcmener: -0.04313954 hartree
kineticenergy: 1793.40323371 hartree
xcener: -149.352198975463 hartree
chargesum: 0.0000000
charge: 0.871401 -0.494604 -0.484042 -0.491214 -0.453998 -0.292900 -0.290505 -0.216528 -0.064122 -0.182943 -0.118602 -0.424483 -0.425788 0.166113 -0.072866 0.249127 -0.203602 -0.122749 -0.106330 -0.178377 -0.182668 -0.192111 0.306497 0.373054 0.412032 0.418443 -0.325016 -0.116589 -0.125054 0.190998 0.142191 0.146245 0.161203 0.161652 0.207754 0.122730 0.105656 0.112514 0.114366 0.130585 0.121227 0.144269 0.131176 0.112563 0.113722 0.138203 0.109239 0.115697 0.186436
qa: 0.8714 -0.4946 -0.4840 -0.4912 -0.4540 -0.2929 -0.2905 -0.2165 -0.0641 -0.1829 -0.1186 -0.4245 -0.4258 0.1661 -0.0729 0.2491 -0.2036 -0.1227 -0.1063 -0.1784 -0.1827 -0.1921 0.3065 0.3731 0.4120 0.4184 -0.3250 -0.1166 -0.1251 0.1910 0.1422 0.1462 0.1612 0.1617 0.2078 0.1227 0.1057 0.1125 0.1144 0.1306 0.1212 0.1443 0.1312 0.1126 0.1137 0.1382 0.1092 0.1157 0.1864
va: 6.0482 1.9974 2.0130 2.0024 2.0596 2.1287 2.1384 3.0533 3.1446 3.0619 3.1828 2.9609 2.9663 3.6856 3.8015 4.1676 4.0954 3.9228 3.8939 3.9227 3.8635 3.8914 4.4850 4.2339 4.0300 3.9958 3.9272 3.8503 3.8452 1.0274 1.0202 1.0045 0.9886 0.9893 1.0734 0.9976 1.0251 0.9977 0.9967 0.9912 0.9853 1.0166 0.9936 0.9956 0.9959 0.9958 0.9944 0.9923 1.0206
dispcorr: -0.030896395 hartree
energy: -1800.051365369903
dipole: 1.37184 -1.41174 -0.03990 -11.66498 10.06801 -1.59697 -11.48639 9.11714 -2.36925
magnitude: 2.85749 au
magnitude: 7.26316 debye
