program: Orca
programVersion: 4.2.1
elementType: S O O O O O O N N N N N N C C C C C C C C C C C C C C C C H H H H H H H H H H H H H H H H H H H H
charge: 0
multiplicity: 1
keywords: wb97x-d3
keywords: def2-TZVPP
keywords: def2/J RIJCOSX GRIDX6 NOFINALGRIDX
keywords: grid4 nofinalgrid
keywords: scfconv7
keywords: smallprint printgap noloewdin
keywords: NOSOSCF
formula: C16H20N6O6S
InChI: InChI=1S/C16H20N6O6S/c1-22(2)14(23)10-7-5-6-8-11(10)20-29(25,26)21-16(24)19-15-17-12(27-3)9-13(18-15)28-4/h5-9,19-21H,1-4H3
49 atoms
S  1.786593 0.80299 1.82963
O  1.892359 2.181908 1.415287
O  2.050029 0.399053 3.18733
O  0.103612 -1.260663 -1.341878
O  0.381913 -1.772525 2.042618
O  -5.651934 -0.391144 -0.723094
O  -2.647304 3.134893 -0.419006
N  2.778779 -0.092687 0.878155
N  1.724825 -2.761118 -0.83833
N  0.219809 0.405756 1.436217
N  -1.593333 -1.030269 1.23955
N  -3.620261 -0.713181 0.263412
N  -2.09435 1.07876 0.404241
C  2.956086 0.225509 -0.494072
C  2.311087 -0.491614 -1.500623
C  1.285915 -1.547759 -1.206907
C  3.81907 1.2644 -0.824119
C  2.536348 -0.151306 -2.830386
C  4.035035 1.59673 -2.150746
C  3.395896 0.885016 -3.156237
C  0.789445 -3.816057 -0.512547
C  3.117119 -3.133704 -0.724964
C  -0.279089 -0.856031 1.599895
C  -2.464856 -0.174531 0.607024
C  -4.482024 0.089337 -0.343282
C  -2.970765 1.873706 -0.199459
C  -4.216625 1.428142 -0.607907
C  -5.935579 -1.768225 -0.494312
C  -1.369744 3.603383 0.004122
H  2.855525 -1.061735 1.170032
H  4.330145 1.800607 -0.0362
H  2.03641 -0.703783 -3.615964
H  4.709657 2.405209 -2.398527
H  3.566381 1.135474 -4.194819
H  -0.386965 1.108729 0.994156
H  0.941124 -4.668804 -1.177341
H  -0.233605 -3.471334 -0.620959
H  0.937978 -4.152472 0.514319
H  3.779221 -2.355768 -1.094245
H  3.38138 -3.354704 0.311765
H  3.309648 -4.03163 -1.314632
H  -4.928913 2.0737 -1.100549
H  -5.937232 -2.010335 0.568598
H  -5.226508 -2.417257 -1.008689
H  -6.930361 -1.933754 -0.899888
H  -1.340091 4.656938 -0.261121
H  -0.558912 3.089483 -0.514216
H  -1.240786 3.509157 1.083035
H  -1.929661 -1.977929 1.343144
elementType: S O N C H
totalener: -1800.02067657 hartree
nucrepener: 3265.28608103 hartree
electener: -5065.30675760 hartree
oneelecener: -8960.69027714 hartree
twoeener: 3895.38351954 hartree
cpcmener: -0.04309619 hartree
kineticenergy: 1793.40497661 hartree
xcener: -149.352615519674 hartree
chargesum: 0.0000000
charge: 0.871323 -0.495101 -0.484280 -0.489862 -0.453660 -0.292925 -0.290642 -0.216854 -0.064587 -0.182277 -0.116694 -0.426107 -0.425353 0.166196 -0.074087 0.247801 -0.202440 -0.121692 -0.105600 -0.178722 -0.183063 -0.192010 0.305095 0.374980 0.411450 0.416865 -0.325255 -0.116580 -0.124082 0.190838 0.141896 0.146181 0.161232 0.161568 0.208100 0.123156 0.105411 0.112578 0.129854 0.121462 0.114631 0.144527 0.112704 0.113380 0.131226 0.138201 0.109014 0.115236 0.186970
qa: 0.8713 -0.4951 -0.4843 -0.4899 -0.4537 -0.2929 -0.2906 -0.2169 -0.0646 -0.1823 -0.1167 -0.4261 -0.4254 0.1662 -0.0741 0.2478 -0.2024 -0.1217 -0.1056 -0.1787 -0.1831 -0.1920 0.3051 0.3750 0.4114 0.4169 -0.3253 -0.1166 -0.1241 0.1908 0.1419 0.1462 0.1612 0.1616 0.2081 0.1232 0.1054 0.1126 0.1299 0.1215 0.1146 0.1445 0.1127 0.1134 0.1312 0.1382 0.1090 0.1152 0.1870
va: 6.0483 1.9966 2.0128 2.0040 2.0602 2.1286 2.1380 3.0543 3.1439 3.0635 3.1826 2.9626 2.9666 3.6859 3.8037 4.1699 4.0961 3.9223 3.8917 3.9225 3.8627 3.8910 4.4828 4.2316 4.0308 3.9975 3.9267 3.8504 3.8453 1.0270 1.0202 1.0043 0.9885 0.9894 1.0729 0.9974 1.0252 0.9978 0.9915 0.9854 0.9966 1.0165 0.9956 0.9959 0.9936 0.9955 0.9943 0.9926 1.0202
dispcorr: -0.030858793 hartree
energy: -1800.051535366922
dipole: 1.35700 -1.39016 -0.03316 -11.36531 9.79140 -1.57390 -11.73921 9.36857 -2.37064
magnitude: 2.84573 au
magnitude: 7.23328 debye
