program: Orca
programVersion: 4.2.1
elementType: S O O O O O O N N N N N N C C C C C C C C C C C C C C C C H H H H H H H H H H H H H H H H H H H H
charge: 0
multiplicity: 1
keywords: wb97x-d3
keywords: def2-TZVPP
keywords: def2/J RIJCOSX GRIDX6 NOFINALGRIDX
keywords: grid4 nofinalgrid
keywords: scfconv7
keywords: smallprint printgap noloewdin
keywords: NOSOSCF
formula: C16H20N6O6S
InChI: InChI=1S/C16H20N6O6S/c1-22(2)14(23)10-7-5-6-8-11(10)20-29(25,26)21-16(24)19-15-17-12(27-3)9-13(18-15)28-4/h5-9,19-21H,1-4H3
49 atoms
S  1.562052 0.739754 2.134463
O  1.973106 2.075298 2.459768
O  1.257467 -0.227707 3.162687
O  4.195435 0.973057 -1.092448
O  0.857571 1.961351 -0.545116
O  -5.598337 0.027676 -1.309464
O  -3.438583 -1.465506 2.520596
N  2.697036 0.149577 1.102611
N  2.834911 0.822857 -2.884886
N  0.141928 0.74195 1.241432
N  -1.275485 1.223377 -0.529715
N  -3.433543 0.629519 -0.920203
N  -2.344064 -0.128132 1.030812
C  2.460408 -0.95292 0.267537
C  2.713291 -0.854949 -1.108574
C  3.292417 0.400707 -1.681608
C  1.986363 -2.151001 0.795458
C  2.546003 -1.982491 -1.906906
C  1.786747 -3.24613 -0.026719
C  2.079824 -3.173601 -1.37959
C  3.481267 1.970626 -3.484661
C  1.512585 0.546212 -3.397965
C  -0.010971 1.354962 0.033815
C  -2.39384 0.542295 -0.10879
C  -4.523915 -0.021689 -0.543087
C  -3.444047 -0.779535 1.39404
C  -4.599305 -0.76469 0.629942
C  -5.544342 0.790112 -2.504608
C  -2.25359 -1.487417 3.305762
H  3.299021 0.868281 0.706345
H  1.808118 -2.234462 1.857493
H  2.793564 -1.923941 -2.959346
H  1.426821 -4.171936 0.402165
H  1.957259 -4.039007 -2.016326
H  -0.654194 0.214294 1.611683
H  3.331473 1.93542 -4.563774
H  4.547764 1.961444 -3.281541
H  3.066515 2.908175 -3.105493
H  0.926217 1.467666 -3.424785
H  1.562591 0.144157 -4.412345
H  0.980288 -0.163396 -2.773427
H  -5.493857 -1.291045 0.924828
H  -5.341743 1.84255 -2.304237
H  -6.525835 0.690192 -2.960149
H  -4.785031 0.414171 -3.1909
H  -2.480135 -2.118208 4.160603
H  -1.979577 -0.492811 3.659749
H  -1.409886 -1.912251 2.760557
H  -1.384928 1.707457 -1.407695
totalener: -1799.99544651 hartree
nucrepener: 3221.98899197 hartree
electener: -5021.98443848 hartree
oneelecener: -8871.86439341 hartree
twoeener: 3849.87995493 hartree
kineticenergy: 1793.44027951 hartree
xcener: -149.351776985000 hartree
chargesum: -0.0000000
charge: 0.857664 -0.419375 -0.468045 -0.432406 -0.386458 -0.262012 -0.261258 -0.195401 -0.120919 -0.205108 -0.166607 -0.409832 -0.427353 0.024189 -0.003333 0.332760 -0.188670 -0.164094 -0.091056 -0.136330 -0.180786 -0.222273 0.323454 0.368337 0.383745 0.396314 -0.299236 -0.124772 -0.120527 0.208073 0.157387 0.134719 0.129695 0.128579 0.198201 0.090298 0.112829 0.117293 0.110027 0.119231 0.113826 0.130829 0.109222 0.124910 0.106157 0.129295 0.112354 0.099130 0.167332
qa: 0.8577 -0.4194 -0.4680 -0.4324 -0.3865 -0.2620 -0.2613 -0.1954 -0.1209 -0.2051 -0.1666 -0.4098 -0.4274 0.0242 -0.0033 0.3328 -0.1887 -0.1641 -0.0911 -0.1363 -0.1808 -0.2223 0.3235 0.3683 0.3837 0.3963 -0.2992 -0.1248 -0.1205 0.2081 0.1574 0.1347 0.1297 0.1286 0.1982 0.0903 0.1128 0.1173 0.1100 0.1192 0.1138 0.1308 0.1092 0.1249 0.1062 0.1293 0.1124 0.0991 0.1673
va: 6.0374 2.0897 2.0137 2.0522 2.1252 2.1515 2.1624 3.0834 3.0861 3.0773 3.1632 2.9726 2.9753 3.9780 3.6216 4.0666 4.0669 3.9464 3.9663 3.9784 3.9120 3.9236 4.4133 4.2348 4.0592 4.0260 3.9348 3.8756 3.8724 1.0498 1.0183 1.0049 0.9993 1.0003 1.0726 0.9922 1.0133 0.9931 0.9964 0.9936 0.9933 1.0213 0.9968 0.9943 0.9969 0.9958 0.9956 0.9957 1.0360
dispcorr: -0.029233988 hartree
energy: -1800.024680494870
dipole: -4.30015 1.84310 -2.45704 -4.03556 2.79891 -1.23665 -19.09248 16.90045 -2.19203
magnitude: 3.51729 au
magnitude: 8.94025 debye
