program: Orca
programVersion: 4.2.1
elementType: S O O O O O O N N N N N N C C C C C C C C C C C C C C C C H H H H H H H H H H H H H H H H H H H H
charge: 0
multiplicity: 1
keywords: wb97x-d3
keywords: def2-TZVPP
keywords: def2/J RIJCOSX GRIDX6 NOFINALGRIDX
keywords: grid4 nofinalgrid
keywords: scfconv7
keywords: smallprint printgap noloewdin
keywords: NOSOSCF
formula: C16H20N6O6S
InChI: InChI=1S/C16H20N6O6S/c1-22(2)14(23)10-7-5-6-8-11(10)20-29(25,26)21-16(24)19-15-17-12(27-3)9-13(18-15)28-4/h5-9,19-21H,1-4H3
49 atoms
S  1.524795 1.078896 1.990985
O  1.868599 2.465529 2.124592
O  1.232089 0.256321 3.141197
O  4.210802 0.9583 -1.200985
O  0.838568 1.880945 -0.845554
O  -5.62785 -0.099125 -1.348263
O  -3.493731 -1.047539 2.664455
N  2.714033 0.400789 1.083417
N  2.874972 0.4665 -2.950495
N  0.129041 0.889589 1.078566
N  -1.288011 1.1331 -0.74185
N  -3.453825 0.519959 -1.046048
N  -2.374653 0.035434 0.996049
C  2.560953 -0.831537 0.428751
C  2.834418 -0.932093 -0.943136
C  3.345997 0.254949 -1.698387
C  2.15525 -1.961532 1.133338
C  2.753214 -2.177804 -1.557846
C  2.04275 -3.182062 0.490505
C  2.355069 -3.300997 -0.854685
C  3.452274 1.554503 -3.71072
C  1.578705 0.03214 -3.418182
C  -0.026794 1.345404 -0.196213
C  -2.415275 0.535331 -0.228344
C  -4.55443 -0.051628 -0.5803
C  -3.486339 -0.534779 1.449203
C  -4.641822 -0.612157 0.68923
C  -5.558088 0.467211 -2.647175
C  -2.315825 -0.960913 3.455345
H  3.280752 1.083402 0.584528
H  1.960933 -1.890349 2.19336
H  3.014386 -2.266437 -2.604996
H  1.736051 -4.052041 1.055858
H  2.299725 -4.260913 -1.349569
H  -0.66614 0.417221 1.517914
H  3.320071 1.351467 -4.77353
H  4.513982 1.647484 -3.503842
H  2.970629 2.506898 -3.474468
H  1.089606 -0.615893 -2.698666
H  0.932923 0.899203 -3.575161
H  1.664695 -0.505913 -4.364803
H  -5.545318 -1.073368 1.056946
H  -5.333411 1.533515 -2.612727
H  -6.541444 0.317878 -3.084743
H  -4.806924 -0.02695 -3.264024
H  -2.558971 -1.44563 4.396605
H  -2.030449 0.073391 3.651054
H  -1.473649 -1.478194 2.99392
H  -1.394554 1.493203 -1.677905
totalener: -1799.99568213 hartree
nucrepener: 3213.07630289 hartree
electener: -5013.07198503 hartree
oneelecener: -8854.07920912 hartree
twoeener: 3841.00722410 hartree
kineticenergy: 1793.43989726 hartree
xcener: -149.351290724072 hartree
chargesum: -0.0000000
charge: 0.857375 -0.419812 -0.468228 -0.432226 -0.388633 -0.262144 -0.261077 -0.194639 -0.120113 -0.204726 -0.167021 -0.410081 -0.427900 0.019367 -0.003157 0.331366 -0.181189 -0.162547 -0.092481 -0.136849 -0.179913 -0.222789 0.327134 0.368163 0.384037 0.395891 -0.298911 -0.125846 -0.125028 0.207571 0.156627 0.134486 0.129882 0.128404 0.197915 0.089943 0.113268 0.116831 0.115575 0.108317 0.119327 0.130736 0.109195 0.125324 0.106569 0.129331 0.113258 0.102151 0.167267
qa: 0.8574 -0.4198 -0.4682 -0.4322 -0.3886 -0.2621 -0.2611 -0.1946 -0.1201 -0.2047 -0.1670 -0.4101 -0.4279 0.0194 -0.0032 0.3314 -0.1812 -0.1625 -0.0925 -0.1368 -0.1799 -0.2228 0.3271 0.3682 0.3840 0.3959 -0.2989 -0.1258 -0.1250 0.2076 0.1566 0.1345 0.1299 0.1284 0.1979 0.0899 0.1133 0.1168 0.1156 0.1083 0.1193 0.1307 0.1092 0.1253 0.1066 0.1293 0.1133 0.1022 0.1673
va: 6.0361 2.0889 2.0140 2.0532 2.1232 2.1518 2.1619 3.0813 3.0856 3.0772 3.1611 2.9720 2.9746 3.9845 3.6159 4.0694 4.0667 3.9458 3.9643 3.9775 3.9103 3.9229 4.4108 4.2359 4.0587 4.0276 3.9355 3.8757 3.8710 1.0500 1.0186 1.0052 0.9992 1.0003 1.0707 0.9924 1.0135 0.9937 0.9930 0.9965 0.9940 1.0213 0.9967 0.9940 0.9969 0.9958 0.9956 0.9951 1.0361
dispcorr: -0.028968197 hartree
energy: -1800.024650329711
dipole: -3.90679 1.52168 -2.38511 -6.86061 5.26095 -1.59966 -18.15761 16.17752 -1.98009
magnitude: 3.48832 au
magnitude: 8.86661 debye
