program: Orca
programVersion: 4.2.1
elementType: S O O O O O O N N N N N N C C C C C C C C C C C C C C C C H H H H H H H H H H H H H H H H H H H H
charge: 0
multiplicity: 1
keywords: wb97x-d3
keywords: def2-TZVPP
keywords: def2/J RIJCOSX GRIDX6 NOFINALGRIDX
keywords: grid4 nofinalgrid
keywords: scfconv7
keywords: smallprint printgap noloewdin
keywords: NOSOSCF
formula: C16H20N6O6S
InChI: InChI=1S/C16H20N6O6S/c1-22(2)14(23)10-7-5-6-8-11(10)20-29(25,26)21-16(24)19-15-17-12(27-3)9-13(18-15)28-4/h5-9,19-21H,1-4H3
49 atoms
S  1.555665 0.890373 1.999127
O  1.795571 2.287389 2.22599
O  1.326927 -0.025587 3.091788
O  4.192247 1.156301 -1.237084
O  0.795247 1.843378 -0.772351
O  -5.752679 0.111454 -1.06784
O  -3.41417 -1.320594 2.679586
N  2.788955 0.364622 1.053265
N  2.842949 0.628289 -2.967136
N  0.172835 0.66324 1.073803
N  -1.324476 1.080415 -0.649827
N  -3.533751 0.595374 -0.861804
N  -2.35115 -0.135397 1.044916
C  2.742444 -0.847441 0.344916
C  2.996772 -0.859888 -1.033417
C  3.375701 0.403151 -1.742646
C  2.465912 -2.041772 1.004274
C  3.026961 -2.078981 -1.703739
C  2.463624 -3.238136 0.308472
C  2.758216 -3.266105 -1.045787
C  3.288733 1.799557 -3.690607
C  1.575593 0.096924 -3.413667
C  -0.040916 1.243883 -0.140814
C  -2.445304 0.484547 -0.120154
C  -4.630015 0.031331 -0.37693
C  -3.45946 -0.694956 1.51927
C  -4.663933 -0.646369 0.836855
C  -5.742079 0.815531 -2.299455
C  -2.182979 -1.365433 3.388782
H  3.285142 1.118834 0.583529
H  2.285219 -2.03663 2.068944
H  3.273096 -2.094037 -2.758109
H  2.256977 -4.158514 0.838358
H  2.789453 -4.204311 -1.582711
H  -0.608316 0.161454 1.506286
H  2.725024 2.688497 -3.395661
H  3.142744 1.632398 -4.757918
H  4.342656 1.986194 -3.508717
H  1.17099 -0.621834 -2.70874
H  0.849618 0.90727 -3.512949
H  1.676356 -0.392262 -4.385064
H  -5.564791 -1.098581 1.221861
H  -6.75835 0.755611 -2.67959
H  -5.057659 0.364064 -3.018221
H  -5.46521 1.861603 -2.165125
H  -1.827306 -0.369447 3.655663
H  -1.404361 -1.878221 2.822463
H  -2.388839 -1.923349 4.297781
H  -1.471712 1.532253 -1.539488
totalener: -1799.99587612 hartree
nucrepener: 3201.08803217 hartree
electener: -5001.08390829 hartree
oneelecener: -8830.16362748 hartree
twoeener: 3829.07971919 hartree
kineticenergy: 1793.43837353 hartree
xcener: -149.350408014112 hartree
chargesum: -0.0000000
charge: 0.858086 -0.420590 -0.468959 -0.430782 -0.390752 -0.262093 -0.261014 -0.196251 -0.119424 -0.205987 -0.167988 -0.409149 -0.428671 0.027829 -0.005010 0.326620 -0.175078 -0.162065 -0.093104 -0.137623 -0.179558 -0.220752 0.330364 0.366584 0.385182 0.397481 -0.300102 -0.125514 -0.126268 0.207105 0.153147 0.133353 0.129802 0.128512 0.196751 0.116153 0.089967 0.113206 0.116130 0.106176 0.119549 0.130497 0.125192 0.106542 0.109268 0.112496 0.104094 0.129251 0.167397
qa: 0.8581 -0.4206 -0.4690 -0.4308 -0.3908 -0.2621 -0.2610 -0.1963 -0.1194 -0.2060 -0.1680 -0.4091 -0.4287 0.0278 -0.0050 0.3266 -0.1751 -0.1621 -0.0931 -0.1376 -0.1796 -0.2208 0.3304 0.3666 0.3852 0.3975 -0.3001 -0.1255 -0.1263 0.2071 0.1531 0.1334 0.1298 0.1285 0.1968 0.1162 0.0900 0.1132 0.1161 0.1062 0.1195 0.1305 0.1252 0.1065 0.1093 0.1125 0.1041 0.1293 0.1674
va: 6.0331 2.0880 2.0129 2.0558 2.1199 2.1517 2.1619 3.0808 3.0842 3.0758 3.1593 2.9725 2.9744 3.9784 3.6225 4.0716 4.0718 3.9456 3.9625 3.9781 3.9095 3.9235 4.4079 4.2405 4.0572 4.0247 3.9354 3.8755 3.8697 1.0496 1.0206 1.0062 0.9989 1.0003 1.0714 0.9942 0.9923 1.0140 0.9928 0.9972 0.9938 1.0214 0.9941 0.9968 0.9969 0.9972 0.9946 0.9957 1.0362
dispcorr: -0.028688118 hartree
energy: -1800.024564237539
dipole: -3.93111 1.58583 -2.34529 -5.81623 4.27903 -1.53720 -18.15694 16.18518 -1.97177
magnitude: 3.42801 au
magnitude: 8.71330 debye
