program: Orca
programVersion: 4.2.1
elementType: S O O O O O O N N N N N N C C C C C C C C C C C C C C C C H H H H H H H H H H H H H H H H H H H H
charge: 0
multiplicity: 1
keywords: wb97x-d3
keywords: def2-TZVPP
keywords: def2/J RIJCOSX GRIDX6 NOFINALGRIDX
keywords: grid4 nofinalgrid
keywords: scfconv7
keywords: smallprint printgap noloewdin
keywords: NOSOSCF
formula: C16H20N6O6S
InChI: InChI=1S/C16H20N6O6S/c1-22(2)14(23)10-7-5-6-8-11(10)20-29(25,26)21-16(24)19-15-17-12(27-3)9-13(18-15)28-4/h5-9,19-21H,1-4H3
49 atoms
S  1.525927 1.039863 2.015995
O  1.871117 2.423285 2.177643
O  1.23079 0.197242 3.151051
O  4.207418 0.965802 -1.184602
O  0.847743 1.888874 -0.808368
O  -5.61931 -0.076256 -1.359022
O  -3.492316 -1.099148 2.63938
N  2.714527 0.376842 1.096715
N  2.873393 0.495849 -2.941814
N  0.131418 0.868149 1.097781
N  -1.280948 1.145149 -0.721319
N  -3.446118 0.537546 -1.041149
N  -2.371458 0.017004 0.994374
C  2.557583 -0.844941 0.422995
C  2.826667 -0.924962 -0.951001
C  3.341372 0.270453 -1.690715
C  2.150643 -1.984622 1.111194
C  2.738877 -2.160744 -1.584807
C  2.031189 -3.194361 0.449651
C  2.338389 -3.293262 -0.898345
C  3.459733 1.585894 -3.69176
C  1.572079 0.079222 -3.411526
C  -0.020556 1.345517 -0.16934
C  -2.409299 0.538313 -0.221162
C  -4.547233 -0.043435 -0.588485
C  -3.48321 -0.56367 1.434015
C  -4.63663 -0.628551 0.669775
C  -5.549162 0.520044 -2.64437
C  -2.314216 -1.030862 3.431752
H  3.279089 1.067262 0.606239
H  1.960112 -1.929676 2.172777
H  2.996915 -2.233842 -2.633907
H  1.723156 -4.071941 1.002398
H  2.277582 -4.244962 -1.408225
H  -0.668205 0.395922 1.529603
H  3.323734 1.394693 -4.756282
H  4.522779 1.666248 -3.486184
H  2.98831 2.540877 -3.445624
H  1.079237 -0.5742 -2.699458
H  0.933386 0.953862 -3.555299
H  1.650719 -0.446848 -4.365433
H  -5.540236 -1.098251 1.026296
H  -5.331218 1.586639 -2.584501
H  -6.530281 0.375066 -3.08825
H  -4.793249 0.045069 -3.270217
H  -2.027078 -0.001285 3.648917
H  -1.473049 -1.539731 2.959143
H  -2.55799 -1.534747 4.362751
H  -1.38515 1.521503 -1.651203
totalener: -1799.99561419 hartree
nucrepener: 3214.10514442 hartree
electener: -5014.10075861 hartree
oneelecener: -8856.13069748 hartree
twoeener: 3842.02993887 hartree
kineticenergy: 1793.44139049 hartree
xcener: -149.351533316776 hartree
chargesum: -0.0000000
charge: 0.857393 -0.419804 -0.468336 -0.431901 -0.388655 -0.262111 -0.261090 -0.194888 -0.120511 -0.204183 -0.166943 -0.410098 -0.427819 0.019351 -0.002498 0.331206 -0.179971 -0.163401 -0.093152 -0.136373 -0.180068 -0.222619 0.326437 0.368293 0.383975 0.395979 -0.299028 -0.125729 -0.124350 0.207739 0.156521 0.134594 0.129898 0.128455 0.197704 0.089851 0.113036 0.116842 0.115312 0.108480 0.119129 0.130811 0.109224 0.125272 0.106541 0.112912 0.101996 0.129282 0.167295
qa: 0.8574 -0.4198 -0.4683 -0.4319 -0.3887 -0.2621 -0.2611 -0.1949 -0.1205 -0.2042 -0.1669 -0.4101 -0.4278 0.0194 -0.0025 0.3312 -0.1800 -0.1634 -0.0932 -0.1364 -0.1801 -0.2226 0.3264 0.3683 0.3840 0.3960 -0.2990 -0.1257 -0.1243 0.2077 0.1565 0.1346 0.1299 0.1285 0.1977 0.0899 0.1130 0.1168 0.1153 0.1085 0.1191 0.1308 0.1092 0.1253 0.1065 0.1129 0.1020 0.1293 0.1673
va: 6.0355 2.0889 2.0137 2.0533 2.1230 2.1518 2.1620 3.0823 3.0845 3.0772 3.1613 2.9720 2.9749 3.9837 3.6148 4.0682 4.0662 3.9467 3.9644 3.9775 3.9111 3.9233 4.4110 4.2356 4.0586 4.0275 3.9352 3.8757 3.8711 1.0498 1.0188 1.0054 0.9992 1.0003 1.0710 0.9924 1.0133 0.9936 0.9930 0.9964 0.9941 1.0212 0.9967 0.9941 0.9969 0.9955 0.9952 0.9958 1.0361
dispcorr: -0.028993055 hartree
energy: -1800.024607247684
dipole: -3.92328 1.53461 -2.38867 -6.58875 5.02481 -1.56394 -18.30488 16.29609 -2.00879
magnitude: 3.49097 au
magnitude: 8.87334 debye
