program: Orca
programVersion: 4.2.1
elementType: S O O O O O O N N N N N N C C C C C C C C C C C C C C C C H H H H H H H H H H H H H H H H H H H H
charge: 0
multiplicity: 1
keywords: wb97x-d3
keywords: def2-TZVPP
keywords: def2/J RIJCOSX GRIDX6 NOFINALGRIDX
keywords: grid4 nofinalgrid
keywords: scfconv7
keywords: smallprint printgap noloewdin
keywords: NOSOSCF
formula: C16H20N6O6S
InChI: InChI=1S/C16H20N6O6S/c1-22(2)14(23)10-7-5-6-8-11(10)20-29(25,26)21-16(24)19-15-17-12(27-3)9-13(18-15)28-4/h5-9,19-21H,1-4H3
49 atoms
S  1.528827 0.873242 1.988138
O  1.745866 2.2740 2.216356
O  1.305884 -0.044644 3.080417
O  4.178274 1.183344 -1.219519
O  0.779715 1.793446 -0.800173
O  -5.789918 0.139252 -1.050531
O  -3.452681 -1.283809 2.70124
N  2.776632 0.365561 1.052235
N  2.879365 0.618317 -2.975625
N  0.155947 0.624961 1.053291
N  -1.34853 1.05867 -0.660531
N  -3.564321 0.597854 -0.858918
N  -2.383089 -0.12647 1.051031
C  2.75415 -0.8477 0.34483
C  3.022324 -0.857643 -1.03122
C  3.388706 0.410208 -1.738016
C  2.490092 -2.045356 1.003052
C  3.078231 -2.077134 -1.699128
C  2.512803 -3.242325 0.308823
C  2.821177 -3.267395 -1.04237
C  3.321311 1.793168 -3.695735
C  1.62903 0.065854 -3.444152
C  -0.059846 1.206948 -0.160836
C  -2.474369 0.481772 -0.12034
C  -4.665599 0.053469 -0.362981
C  -3.495868 -0.66849 1.535386
C  -4.702693 -0.611393 0.857835
C  -5.774895 0.826529 -2.291593
C  -2.218416 -1.337566 3.40468
H  3.261401 1.126509 0.580587
H  2.299002 -2.041911 2.065971
H  3.335801 -2.090045 -2.750755
H  2.315922 -4.164995 0.838323
H  2.872461 -4.205502 -1.577755
H  -0.632988 0.144474 1.496193
H  3.193422 1.620813 -4.764499
H  4.370102 1.993537 -3.499046
H  2.742537 2.676212 -3.412427
H  1.221608 -0.655505 -2.743594
H  0.892669 0.864415 -3.561266
H  1.755998 -0.426121 -4.411048
H  -5.607499 -1.048547 1.251043
H  -5.478734 1.869275 -2.17334
H  -6.794511 0.779353 -2.664624
H  -5.103108 0.353155 -3.008327
H  -2.423668 -1.895692 4.313832
H  -1.855461 -0.343844 3.671181
H  -1.44536 -1.854395 2.834153
H  -1.49369 1.504007 -1.553829
totalener: -1799.99595604 hartree
nucrepener: 3196.80975267 hartree
electener: -4996.80570871 hartree
oneelecener: -8821.64961886 hartree
twoeener: 3824.84391015 hartree
kineticenergy: 1793.43780490 hartree
xcener: -149.350274288157 hartree
chargesum: -0.0000000
charge: 0.858137 -0.421191 -0.469270 -0.431721 -0.392317 -0.262101 -0.260938 -0.195964 -0.120296 -0.206238 -0.167582 -0.408880 -0.428320 0.026980 -0.003032 0.327350 -0.173262 -0.163719 -0.093235 -0.137408 -0.179680 -0.219846 0.333219 0.365982 0.385465 0.397744 -0.300388 -0.125769 -0.126843 0.207310 0.152620 0.133833 0.129567 0.128310 0.195225 0.089942 0.112950 0.116018 0.116618 0.106631 0.119008 0.130383 0.109250 0.125158 0.106760 0.129195 0.113212 0.104096 0.167038
qa: 0.8581 -0.4212 -0.4693 -0.4317 -0.3923 -0.2621 -0.2609 -0.1960 -0.1203 -0.2062 -0.1676 -0.4089 -0.4283 0.0270 -0.0030 0.3274 -0.1733 -0.1637 -0.0932 -0.1374 -0.1797 -0.2198 0.3332 0.3660 0.3855 0.3977 -0.3004 -0.1258 -0.1268 0.2073 0.1526 0.1338 0.1296 0.1283 0.1952 0.0899 0.1130 0.1160 0.1166 0.1066 0.1190 0.1304 0.1093 0.1252 0.1068 0.1292 0.1132 0.1041 0.1670
va: 6.0318 2.0874 2.0122 2.0544 2.1190 2.1517 2.1620 3.0817 3.0858 3.0753 3.1590 2.9724 2.9742 3.9826 3.6219 4.0669 4.0729 3.9467 3.9626 3.9776 3.9107 3.9222 4.4070 4.2415 4.0567 4.0242 3.9355 3.8755 3.8691 1.0504 1.0210 1.0060 0.9990 1.0004 1.0729 0.9924 1.0136 0.9941 0.9929 0.9971 0.9934 1.0215 0.9969 0.9940 0.9967 0.9957 0.9970 0.9947 1.0365
dispcorr: -0.028541695 hartree
energy: -1800.024497733310
dipole: -3.61586 1.30417 -2.31169 -5.81040 4.27514 -1.53526 -18.19060 16.21086 -1.97974
magnitude: 3.40886 au
magnitude: 8.66463 debye
