program: Orca
programVersion: 4.2.1
elementType: S O O O O O O N N N N N N C C C C C C C C C C C C C C C C H H H H H H H H H H H H H H H H H H H H
charge: 0
multiplicity: 1
keywords: wb97x-d3
keywords: def2-TZVPP
keywords: def2/J RIJCOSX GRIDX6 NOFINALGRIDX
keywords: grid4 nofinalgrid
keywords: scfconv7
keywords: smallprint printgap noloewdin
keywords: NOSOSCF
formula: C16H20N6O6S
InChI: InChI=1S/C16H20N6O6S/c1-22(2)14(23)10-7-5-6-8-11(10)20-29(25,26)21-16(24)19-15-17-12(27-3)9-13(18-15)28-4/h5-9,19-21H,1-4H3
49 atoms
S  1.515874 0.967822 1.996364
O  1.812323 2.360062 2.179296
O  1.247576 0.098487 3.11779
O  4.205116 1.043561 -1.19681
O  0.808311 1.839266 -0.816853
O  -5.713839 0.02535 -1.229172
O  -3.489465 -1.159238 2.670745
N  2.729154 0.36128 1.071678
N  2.876605 0.554355 -2.953296
N  0.129693 0.763411 1.072776
N  -1.318947 1.094414 -0.709081
N  -3.511757 0.560331 -0.972296
N  -2.388092 -0.04368 1.012828
C  2.624102 -0.856602 0.381357
C  2.903218 -0.905825 -0.991836
C  3.364822 0.322912 -1.711666
C  2.261774 -2.02167 1.051568
C  2.873314 -2.134996 -1.643133
C  2.199244 -3.226267 0.372913
C  2.519388 -3.293345 -0.974123
C  3.403006 1.687795 -3.682938
C  1.598962 0.076522 -3.429536
C  -0.04781 1.278594 -0.17651
C  -2.449299 0.50922 -0.187642
C  -4.615972 0.004903 -0.495443
C  -3.503339 -0.597323 1.477557
C  -4.683178 -0.605975 0.751957
C  -5.668075 0.651389 -2.501424
C  -2.283619 -1.144405 3.423514
H  3.27148 1.078931 0.595551
H  2.061192 -1.989177 2.112305
H  3.138621 -2.18194 -2.691927
H  1.925718 -4.123892 0.911533
H  2.503869 -4.239758 -1.497107
H  -0.664333 0.284928 1.508382
H  3.273575 1.511461 -4.750824
H  4.460927 1.819826 -3.478061
H  2.8824 2.611048 -3.415599
H  0.92275 0.921188 -3.580292
H  1.705954 -0.449507 -4.380957
H  1.131167 -0.594809 -2.71717
H  -5.590049 -1.052974 1.128778
H  -6.670584 0.557239 -2.910038
H  -4.956563 0.162483 -3.167486
H  -5.404294 1.70645 -2.424415
H  -1.476745 -1.671633 2.912831
H  -2.512448 -1.657662 4.353019
H  -1.954586 -0.129382 3.6493
H  -1.439768 1.496253 -1.62624
totalener: -1799.99577307 hartree
nucrepener: 3206.75137096 hartree
electener: -5006.74714403 hartree
oneelecener: -8841.46754070 hartree
twoeener: 3834.72039667 hartree
kineticenergy: 1793.44122978 hartree
xcener: -149.351551421483 hartree
chargesum: 0.0000000
charge: 0.857079 -0.420339 -0.468636 -0.432501 -0.390042 -0.262026 -0.261023 -0.195048 -0.119049 -0.205046 -0.167017 -0.409363 -0.427907 0.023153 -0.005303 0.329470 -0.179281 -0.160082 -0.092694 -0.137898 -0.180008 -0.223072 0.329480 0.366795 0.385000 0.396730 -0.299920 -0.125881 -0.125346 0.207425 0.155422 0.133583 0.129858 0.128468 0.197137 0.090373 0.113212 0.116339 0.108351 0.119486 0.116158 0.130545 0.125322 0.106754 0.109154 0.103271 0.129257 0.112613 0.167043
qa: 0.8571 -0.4203 -0.4686 -0.4325 -0.3900 -0.2620 -0.2610 -0.1950 -0.1190 -0.2050 -0.1670 -0.4094 -0.4279 0.0232 -0.0053 0.3295 -0.1793 -0.1601 -0.0927 -0.1379 -0.1800 -0.2231 0.3295 0.3668 0.3850 0.3967 -0.2999 -0.1259 -0.1253 0.2074 0.1554 0.1336 0.1299 0.1285 0.1971 0.0904 0.1132 0.1163 0.1084 0.1195 0.1162 0.1305 0.1253 0.1068 0.1092 0.1033 0.1293 0.1126 0.1670
va: 6.0350 2.0882 2.0130 2.0540 2.1218 2.1516 2.1621 3.0819 3.0844 3.0763 3.1604 2.9725 2.9748 3.9830 3.6193 4.0706 4.0695 3.9454 3.9638 3.9784 3.9102 3.9243 4.4089 4.2390 4.0571 4.0262 3.9354 3.8756 3.8702 1.0501 1.0194 1.0053 0.9990 1.0003 1.0716 0.9922 1.0136 0.9937 0.9964 0.9934 0.9925 1.0214 0.9940 0.9968 0.9968 0.9949 0.9957 0.9965 1.0363
dispcorr: -0.028826743 hartree
energy: -1800.024599812131
dipole: -3.79673 1.42893 -2.36780 -6.19956 4.65664 -1.54292 -18.22373 16.22417 -1.99956
magnitude: 3.46198 au
magnitude: 8.79965 debye
