program: Orca
programVersion: 4.2.1
elementType: S O O O O O O N N N N N N C C C C C C C C C C C C C C C C H H H H H H H H H H H H H H H H H H H H
charge: 0
multiplicity: 1
keywords: wb97x-d3
keywords: def2-TZVPP
keywords: def2/J RIJCOSX GRIDX6 NOFINALGRIDX
keywords: grid4 nofinalgrid
keywords: scfconv7
keywords: smallprint printgap noloewdin
keywords: NOSOSCF
formula: C16H20N6O6S
InChI: InChI=1S/C16H20N6O6S/c1-22(2)14(23)10-7-5-6-8-11(10)20-29(25,26)21-16(24)19-15-17-12(27-3)9-13(18-15)28-4/h5-9,19-21H,1-4H3
49 atoms
S  1.075622 1.104582 -1.85365
O  1.138771 0.257245 -3.012217
O  0.859166 2.526704 -1.949748
O  2.675744 0.461886 1.7399
O  0.384493 -1.522776 -0.501654
O  -5.883397 -0.310132 1.773611
O  -3.640898 3.305959 -0.084481
N  2.424563 0.856719 -0.958378
N  2.386939 -1.723623 2.198581
N  -0.211851 0.641331 -0.873605
N  -1.645068 -0.835938 0.20086
N  -3.759297 -0.57478 0.987263
N  -2.625725 1.265574 0.038958
C  3.244154 -0.286868 -1.028713
C  3.480114 -1.053206 0.11877
C  2.801094 -0.708926 1.4030
C  3.895127 -0.603082 -2.214872
C  4.426735 -2.07214 0.065867
C  4.793715 -1.653927 -2.259115
C  5.080866 -2.379722 -1.11329
C  1.8734 -1.394616 3.509733
C  2.057318 -3.055654 1.738833
C  -0.417428 -0.624611 -0.416141
C  -2.717147 -0.000991 0.410538
C  -4.807761 0.204747 1.205125
C  -3.685305 2.035376 0.265787
C  -4.838803 1.551505 0.861464
C  -5.873275 -1.685288 2.121349
C  -2.461821 3.810125 -0.698351
H  2.40119 1.286062 -0.034868
H  3.714318 -0.009097 -3.098171
H  4.657417 -2.629882 0.964534
H  5.294644 -1.885309 -3.189522
H  5.812704 -3.175575 -1.136317
H  -0.954879 1.330066 -0.726148
H  0.798948 -1.190252 3.486017
H  2.37645 -0.521583 3.914007
H  2.045568 -2.237829 4.178984
H  2.228936 -3.167657 0.674967
H  2.636216 -3.810297 2.275957
H  0.997515 -3.251942 1.915188
H  -5.699634 2.175661 1.044714
H  -6.847481 -1.883587 2.560083
H  -5.093856 -1.913261 2.848912
H  -5.731013 -2.322911 1.24845
H  -1.589086 3.709337 -0.052162
H  -2.65281 4.864385 -0.877079
H  -2.254782 3.319171 -1.649992
H  -1.783823 -1.783278 0.517674
totalener: -1799.99360089 hartree
nucrepener: 3170.19564602 hartree
electener: -4970.18924690 hartree
oneelecener: -8769.02881919 hartree
twoeener: 3798.83957229 hartree
kineticenergy: 1793.44365700 hartree
xcener: -149.352965483911 hartree
chargesum: -0.0000000
charge: 0.862920 -0.423319 -0.463098 -0.451604 -0.405749 -0.263004 -0.260691 -0.203297 -0.124049 -0.219364 -0.167566 -0.410416 -0.429891 0.113591 0.009565 0.288557 -0.128052 -0.172692 -0.104615 -0.128539 -0.175414 -0.207400 0.352209 0.369112 0.384098 0.397116 -0.299226 -0.125175 -0.130245 0.179835 0.117067 0.131028 0.127548 0.125593 0.196782 0.098104 0.114416 0.094762 0.137730 0.112597 0.096356 0.129691 0.124475 0.106748 0.108438 0.110649 0.128527 0.111310 0.164582
qa: 0.8629 -0.4233 -0.4631 -0.4516 -0.4057 -0.2630 -0.2607 -0.2033 -0.1240 -0.2194 -0.1676 -0.4104 -0.4299 0.1136 0.0096 0.2886 -0.1281 -0.1727 -0.1046 -0.1285 -0.1754 -0.2074 0.3522 0.3691 0.3841 0.3971 -0.2992 -0.1252 -0.1302 0.1798 0.1171 0.1310 0.1275 0.1256 0.1968 0.0981 0.1144 0.0948 0.1377 0.1126 0.0964 0.1297 0.1245 0.1067 0.1084 0.1106 0.1285 0.1113 0.1646
va: 6.0487 2.0595 2.0382 2.0321 2.1056 2.1505 2.1615 3.0957 3.0969 3.1046 3.1614 2.9715 2.9744 3.9416 3.6113 4.0856 4.1210 3.9454 3.9913 3.9686 3.9171 3.9097 4.3845 4.2359 4.0587 4.0254 3.9369 3.8767 3.8650 1.0691 1.0304 1.0040 0.9996 1.0011 1.0668 0.9932 1.0138 0.9931 0.9965 0.9899 0.9975 1.0216 0.9943 0.9967 0.9968 0.9949 0.9959 0.9973 1.0389
dispcorr: -0.027845248 hartree
energy: -1800.021446132994
dipole: 0.32383 -1.49939 -1.17556 -12.13767 10.72359 -1.41407 14.28906 -12.69931 1.58975
magnitude: 2.43081 au
magnitude: 6.17863 debye
