program: Orca
programVersion: 4.2.1
elementType: S O O O O O O N N N N N N C C C C C C C C C C C C C C C C H H H H H H H H H H H H H H H H H H H H
charge: 0
multiplicity: 1
keywords: wb97x-d3
keywords: def2-TZVPP
keywords: def2/J RIJCOSX GRIDX6 NOFINALGRIDX
keywords: grid4 nofinalgrid
keywords: scfconv7
keywords: smallprint printgap noloewdin
keywords: NOSOSCF
formula: C16H20N6O6S
InChI: InChI=1S/C16H20N6O6S/c1-22(2)14(23)10-7-5-6-8-11(10)20-29(25,26)21-16(24)19-15-17-12(27-3)9-13(18-15)28-4/h5-9,19-21H,1-4H3
49 atoms
S  0.643688 -1.654058 1.629265
O  0.238214 -1.385517 2.986571
O  0.670345 -2.983324 1.085213
O  2.705967 1.514002 0.416616
O  0.467287 -0.911696 -1.308117
O  -3.994034 1.108096 2.651906
O  -5.454323 2.376998 -1.568985
N  2.113988 -0.969721 1.395468
N  2.77831 1.439088 -1.832659
N  -0.441206 -0.69947 0.767327
N  -1.495221 0.180043 -1.1043
N  -2.733866 0.632794 0.809463
N  -3.470194 1.276881 -1.338419
C  3.058152 -1.387659 0.437237
C  3.524161 -0.488352 -0.529349
C  2.954432 0.889308 -0.607236
C  3.5995 -2.665355 0.508755
C  4.583519 -0.869041 -1.347924
C  4.615376 -3.042063 -0.351312
C  5.128481 -2.137742 -1.268458
C  2.369495 2.82422 -1.904359
C  2.582452 0.691113 -3.056175
C  -0.414815 -0.52196 -0.582015
C  -2.611387 0.714403 -0.505345
C  -3.827725 1.164953 1.344933
C  -4.555445 1.802117 -0.789988
C  -4.803186 1.781026 0.577892
C  -2.989308 0.492969 3.448007
C  -5.224047 2.39749 -2.968462
H  2.146234 0.030051 1.589175
H  3.239569 -3.356419 1.256235
H  4.990245 -0.158271 -2.05597
H  5.028357 -4.039424 -0.281061
H  5.950636 -2.416365 -1.913411
H  -1.229684 -0.303985 1.287463
H  2.729181 3.251385 -2.840699
H  2.785841 3.393838 -1.079274
H  1.280668 2.927715 -1.877065
H  2.645837 -0.377623 -2.889533
H  1.585886 0.894618 -3.454166
H  3.315602 0.979184 -3.813063
H  -5.691684 2.213102 1.011569
H  -3.340974 0.569121 4.47291
H  -2.030209 1.004804 3.360891
H  -2.852535 -0.55911 3.19532
H  -5.151851 1.39111 -3.381772
H  -4.314688 2.943272 -3.221579
H  -6.082866 2.905246 -3.399147
H  -1.467692 0.283259 -2.107117
totalener: -1799.99347972 hartree
nucrepener: 3174.98462664 hartree
electener: -4974.97810636 hartree
oneelecener: -8778.60032870 hartree
twoeener: 3803.62222234 hartree
kineticenergy: 1793.44465486 hartree
xcener: -149.353348791750 hartree
chargesum: -0.0000000
charge: 0.862485 -0.463406 -0.422761 -0.451958 -0.404847 -0.260889 -0.263002 -0.204695 -0.123855 -0.218068 -0.167269 -0.428664 -0.410559 0.112351 0.014757 0.286420 -0.128114 -0.174973 -0.103650 -0.129396 -0.174972 -0.205941 0.350431 0.369120 0.395876 0.382792 -0.297966 -0.130159 -0.124996 0.180159 0.116494 0.131853 0.127150 0.126093 0.198150 0.094603 0.114831 0.096584 0.137714 0.096077 0.111983 0.130160 0.128301 0.112108 0.110079 0.108902 0.105811 0.124368 0.164489
qa: 0.8625 -0.4634 -0.4228 -0.4520 -0.4048 -0.2609 -0.2630 -0.2047 -0.1239 -0.2181 -0.1673 -0.4287 -0.4106 0.1124 0.0148 0.2864 -0.1281 -0.1750 -0.1037 -0.1294 -0.1750 -0.2059 0.3504 0.3691 0.3959 0.3828 -0.2980 -0.1302 -0.1250 0.1802 0.1165 0.1319 0.1271 0.1261 0.1981 0.0946 0.1148 0.0966 0.1377 0.0961 0.1120 0.1302 0.1283 0.1121 0.1101 0.1089 0.1058 0.1244 0.1645
va: 6.0485 2.0380 2.0606 2.0314 2.1061 2.1615 2.1502 3.0956 3.0968 3.1048 3.1617 2.9756 2.9715 3.9422 3.5976 4.0892 4.1239 3.9465 3.9905 3.9674 3.9178 3.9098 4.3876 4.2344 4.0271 4.0606 3.9360 3.8646 3.8771 1.0691 1.0300 1.0036 0.9997 1.0009 1.0660 0.9930 1.0142 0.9937 0.9959 0.9978 0.9900 1.0214 0.9960 0.9950 0.9973 0.9966 0.9971 0.9944 1.0389
dispcorr: -0.027997384 hartree
energy: -1800.021477108800
dipole: 3.69862 -4.43508 -0.73646 10.91618 -9.57364 1.34254 -14.89871 13.01398 -1.88473
magnitude: 2.42837 au
magnitude: 6.17243 debye
