program: Orca
programVersion: 4.2.1
elementType: S O O O O O O N N N N N N C C C C C C C C C C C C C C C C H H H H H H H H H H H H H H H H H H H H
charge: 0
multiplicity: 1
keywords: wb97x-d3
keywords: def2-TZVPP
keywords: def2/J RIJCOSX GRIDX6 NOFINALGRIDX
keywords: grid4 nofinalgrid
keywords: scfconv7
keywords: smallprint printgap noloewdin
keywords: NOSOSCF
formula: C16H20N6O6S
InChI: InChI=1S/C16H20N6O6S/c1-22(2)14(23)10-7-5-6-8-11(10)20-29(25,26)21-16(24)19-15-17-12(27-3)9-13(18-15)28-4/h5-9,19-21H,1-4H3
49 atoms
S  1.796474 0.295907 2.222168
O  2.381062 1.414879 2.898236
O  1.634231 -0.996327 2.839393
O  0.235697 1.0373 -1.982983
O  0.720392 2.701957 0.79889
O  -5.225237 0.443269 -1.436101
O  -2.591976 -2.578164 0.912854
N  2.681481 0.086579 0.818307
N  2.439153 1.555141 -1.907101
N  0.248972 0.66707 1.71172
N  -1.345181 1.83562 0.495131
N  -3.286092 1.143572 -0.463548
N  -1.967869 -0.389482 0.749804
C  2.293389 -0.950022 -0.064354
C  1.686535 -0.683968 -1.296058
C  1.384542 0.70644 -1.768223
C  2.520666 -2.269938 0.316592
C  1.275262 -1.742971 -2.098312
C  2.118588 -3.312572 -0.499656
C  1.487694 -3.053046 -1.707855
C  2.168033 2.932374 -2.26542
C  3.795752 1.113027 -2.15426
C  -0.051343 1.793423 0.987121
C  -2.228919 0.8093 0.254222
C  -4.1482 0.172854 -0.719166
C  -2.831834 -1.357949 0.468726
C  -3.977444 -1.134488 -0.27629
C  -5.396762 1.765162 -1.921421
C  -1.366051 -2.829685 1.586061
H  2.851581 0.988345 0.382386
H  3.016919 -2.471604 1.254161
H  0.78012 -1.529145 -3.03644
H  2.304323 -4.332578 -0.190658
H  1.167243 -3.866557 -2.344434
H  -0.425527 -0.105893 1.66032
H  2.061955 3.057098 -3.346039
H  2.996258 3.552617 -1.925813
H  1.262885 3.279266 -1.779451
H  3.918238 0.055054 -1.940467
H  4.068453 1.273554 -3.201142
H  4.501672 1.670965 -1.536802
H  -4.681967 -1.919393 -0.503679
H  -6.327144 1.75242 -2.483073
H  -4.578717 2.064034 -2.577423
H  -5.472038 2.488457 -1.109036
H  -1.377845 -3.888595 1.82954
H  -1.278027 -2.255433 2.509376
H  -0.503486 -2.618301 0.951483
H  -1.544626 2.674401 -0.02904
totalener: -1799.99016893 hartree
nucrepener: 3326.70757460 hartree
electener: -5126.69774353 hartree
oneelecener: -9081.78580993 hartree
twoeener: 3955.08806640 hartree
kineticenergy: 1793.44240149 hartree
xcener: -149.343273987595 hartree
chargesum: 0.0000000
charge: 0.859161 -0.405573 -0.460411 -0.391756 -0.372819 -0.265797 -0.266216 -0.194638 -0.141001 -0.182818 -0.147602 -0.399400 -0.417149 -0.022118 0.065378 0.237796 -0.150625 -0.123081 -0.125788 -0.124634 -0.166874 -0.195084 0.267876 0.375987 0.384953 0.395979 -0.297795 -0.127333 -0.101306 0.162835 0.131486 0.123877 0.131993 0.132211 0.195330 0.105582 0.097143 0.114770 0.125223 0.109087 0.112939 0.126686 0.121786 0.111700 0.107627 0.123743 0.118225 0.072659 0.167785
qa: 0.8592 -0.4056 -0.4604 -0.3918 -0.3728 -0.2658 -0.2662 -0.1946 -0.1410 -0.1828 -0.1476 -0.3994 -0.4171 -0.0221 0.0654 0.2378 -0.1506 -0.1231 -0.1258 -0.1246 -0.1669 -0.1951 0.2679 0.3760 0.3850 0.3960 -0.2978 -0.1273 -0.1013 0.1628 0.1315 0.1239 0.1320 0.1322 0.1953 0.1056 0.0971 0.1148 0.1252 0.1091 0.1129 0.1267 0.1218 0.1117 0.1076 0.1237 0.1182 0.0727 0.1678
va: 6.0409 2.1039 2.0270 2.0990 2.1302 2.1481 2.1591 3.0409 3.0734 3.1007 3.1866 2.9660 2.9699 3.9346 3.6141 4.1329 4.0419 3.9730 3.9378 3.9208 3.8994 3.8950 4.5014 4.2309 4.0633 4.0149 3.9324 3.8780 3.8817 1.0649 1.0287 1.0176 1.0003 0.9996 1.0847 0.9939 0.9964 1.0223 0.9961 0.9936 0.9889 1.0223 0.9938 0.9966 0.9969 0.9995 0.9952 0.9971 1.0368
dispcorr: -0.033048225 hartree
energy: -1800.023217151988
dipole: 3.25416 -3.48588 -0.23172 -0.68524 -0.05543 -0.74067 -16.50601 14.41302 -2.09299
magnitude: 2.23224 au
magnitude: 5.67389 debye
