program: Orca
programVersion: 4.2.1
elementType: S O O O O O O N N N N N N C C C C C C C C C C C C C C C C H H H H H H H H H H H H H H H H H H H H
charge: 0
multiplicity: 1
keywords: wb97x-d3
keywords: def2-TZVPP
keywords: def2/J RIJCOSX GRIDX6 NOFINALGRIDX
keywords: grid4 nofinalgrid
keywords: scfconv7
keywords: smallprint printgap noloewdin
keywords: NOSOSCF
formula: C16H20N6O6S
InChI: InChI=1S/C16H20N6O6S/c1-22(2)14(23)10-7-5-6-8-11(10)20-29(25,26)21-16(24)19-15-17-12(27-3)9-13(18-15)28-4/h5-9,19-21H,1-4H3
49 atoms
S  1.859748 0.26693 2.230351
O  1.696537 1.582731 2.793843
O  2.352276 -0.857499 2.968513
O  1.59616 1.556908 -1.367545
O  0.466645 -2.346048 1.257344
O  -5.292557 0.136924 -1.256044
O  -2.246522 3.24705 0.360728
N  2.804593 0.479289 0.889395
N  0.299563 -0.034558 -2.304907
N  0.325926 -0.087967 1.6450
N  -1.435971 -1.269074 0.712647
N  -3.361282 -0.571845 -0.272243
N  -1.835354 1.014729 0.579597
C  3.047003 -0.593023 0.00266
C  2.413495 -0.656022 -1.245431
C  1.403633 0.376786 -1.634265
C  3.968956 -1.56608 0.364914
C  2.811076 -1.6425 -2.145343
C  4.308168 -2.569607 -0.523266
C  3.75074 -2.593646 -1.793111
C  -0.584701 0.947347 -2.893581
C  -0.161794 -1.401175 -2.423171
C  -0.132592 -1.30531 1.220186
C  -2.237482 -0.221742 0.334527
C  -4.151455 0.421018 -0.653619
C  -2.624971 2.001033 0.167163
C  -3.834572 1.76202 -0.467422
C  -5.631397 -1.225547 -1.458113
C  -0.949723 3.494771 0.896337
H  2.558979 1.337417 0.399951
H  4.432167 -1.512984 1.339366
H  2.386237 -1.662576 -3.140464
H  5.032478 -3.31846 -0.232916
H  4.046997 -3.349936 -2.507118
H  -0.279432 0.719217 1.46093
H  -0.142565 1.936329 -2.845469
H  -1.548203 0.971716 -2.379457
H  -0.770033 0.695593 -3.939862
H  0.328469 -2.057812 -1.710806
H  -1.23462 -1.430225 -2.221784
H  -0.006271 -1.798281 -3.429887
H  -4.482012 2.560181 -0.796282
H  -5.714515 -1.766574 -0.515251
H  -4.901684 -1.735828 -2.087805
H  -6.596517 -1.216495 -1.957458
H  -0.16848 3.075898 0.260216
H  -0.841699 3.101737 1.907813
H  -0.848568 4.575913 0.924285
H  -1.796491 -2.18012 0.472889
totalener: -1799.98976108 hartree
nucrepener: 3332.95896028 hartree
electener: -5132.94872136 hartree
oneelecener: -9093.62250590 hartree
twoeener: 3960.67378454 hartree
kineticenergy: 1793.44374853 hartree
xcener: -149.349792361785 hartree
chargesum: 0.0000000
charge: 0.858703 -0.458637 -0.407478 -0.456779 -0.335038 -0.261539 -0.258519 -0.206572 -0.094059 -0.197022 -0.155937 -0.400670 -0.392249 0.031924 0.018027 0.284591 -0.087499 -0.173404 -0.097739 -0.116290 -0.179626 -0.233868 0.263204 0.306539 0.382714 0.371468 -0.284636 -0.125741 -0.127053 0.175956 0.124906 0.132003 0.128798 0.128318 0.192571 0.122089 0.077589 0.114476 0.135982 0.096208 0.118450 0.129144 0.110835 0.103090 0.125611 0.107233 0.114715 0.125903 0.169311
qa: 0.8587 -0.4586 -0.4075 -0.4568 -0.3350 -0.2615 -0.2585 -0.2066 -0.0941 -0.1970 -0.1559 -0.4007 -0.3922 0.0319 0.0180 0.2846 -0.0875 -0.1734 -0.0977 -0.1163 -0.1796 -0.2339 0.2632 0.3065 0.3827 0.3715 -0.2846 -0.1257 -0.1271 0.1760 0.1249 0.1320 0.1288 0.1283 0.1926 0.1221 0.0776 0.1145 0.1360 0.0962 0.1184 0.1291 0.1108 0.1031 0.1256 0.1072 0.1147 0.1259 0.1693
va: 6.0434 2.0393 2.0906 2.0265 2.1661 2.1532 2.1611 3.0610 3.0688 3.0817 3.1418 2.9400 2.9416 3.9774 3.5572 4.0713 4.0762 3.9585 3.9893 3.9631 3.8866 3.9143 4.4439 4.2475 4.0379 4.0250 3.9076 3.8826 3.8576 1.0672 1.0259 0.9991 0.9989 1.0002 1.0847 1.0244 0.9997 0.9947 0.9906 1.0030 0.9957 1.0229 0.9965 0.9945 0.9943 1.0014 0.9933 0.9990 1.0341
dispcorr: -0.034417663 hartree
energy: -1800.024178745536
dipole: -9.89954 8.06828 -1.83126 -2.59250 2.01071 -0.58179 -19.54564 17.06301 -2.48263
magnitude: 3.13934 au
magnitude: 7.97956 debye
