program: Orca
programVersion: 4.2.1
elementType: S O O O O O O N N N N N N C C C C C C C C C C C C C C C C H H H H H H H H H H H H H H H H H H H H
charge: 0
multiplicity: 1
keywords: wb97x-d3
keywords: def2-TZVPP
keywords: def2/J RIJCOSX GRIDX6 NOFINALGRIDX
keywords: grid4 nofinalgrid
keywords: scfconv7
keywords: smallprint printgap noloewdin
keywords: NOSOSCF
formula: C16H20N6O6S
InChI: InChI=1S/C16H20N6O6S/c1-22(2)14(23)10-7-5-6-8-11(10)20-29(25,26)21-16(24)19-15-17-12(27-3)9-13(18-15)28-4/h5-9,19-21H,1-4H3
49 atoms
S  1.802833 0.578458 2.111353
O  1.955641 1.990672 1.867915
O  2.134077 -0.038152 3.360852
O  -0.070447 -1.95316 -1.072787
O  0.166963 -1.930709 2.195193
O  -5.460791 -0.061074 -1.045337
O  -2.009864 3.044638 -0.875287
N  2.673759 -0.237338 0.941369
N  1.932087 -2.881086 -0.565532
N  0.198295 0.301972 1.737596
N  -1.697179 -0.976438 1.345843
N  -3.576872 -0.520894 0.153417
N  -1.844589 1.075369 0.264567
C  2.528117 0.182137 -0.403351
C  1.816563 -0.571755 -1.34082
C  1.137963 -1.862489 -0.99183
C  3.107894 1.387353 -0.789477
C  1.663644 -0.086041 -2.63477
C  2.957543 1.852125 -2.083928
C  2.230092 1.118954 -3.010518
C  1.30178 -4.115475 -0.145165
C  3.339245 -2.990938 -0.887352
C  -0.384258 -0.938631 1.784254
C  -2.39153 -0.094656 0.552137
C  -4.265287 0.305973 -0.61697
C  -2.536146 1.883934 -0.52953
C  -3.79151 1.552605 -1.011518
C  -5.950315 -1.337092 -0.665839
C  -0.68332 3.343199 -0.461812
H  2.609087 -1.238997 1.097979
H  3.679537 1.953571 -0.069162
H  1.089845 -0.662775 -3.348345
H  3.416287 2.788994 -2.370168
H  2.108189 1.482007 -4.021895
H  -0.303154 1.031257 1.21703
H  1.108623 -4.779179 -0.991776
H  0.366105 -3.910383 0.362463
H  1.963035 -4.627896 0.551538
H  3.914756 -3.276459 -0.005304
H  3.501375 -3.754339 -1.653476
H  3.7387 -2.054664 -1.265847
H  -4.357389 2.210623 -1.652491
H  -5.307317 -2.14058 -1.025924
H  -6.931271 -1.423076 -1.125813
H  -6.046991 -1.428655 0.416317
H  -0.597399 3.414919 0.623325
H  -0.452265 4.31121 -0.897789
H  0.0334 2.605579 -0.827155
H  -2.114181 -1.893211 1.403672
totalener: -1799.99046775 hartree
nucrepener: 3310.93680640 hartree
electener: -5110.92727415 hartree
oneelecener: -9050.31789606 hartree
twoeener: 3939.39062191 hartree
kineticenergy: 1793.44695721 hartree
xcener: -149.344312160081 hartree
chargesum: -0.0000000
charge: 0.858427 -0.460559 -0.406421 -0.391329 -0.376579 -0.265407 -0.266423 -0.195722 -0.139022 -0.186372 -0.142896 -0.403439 -0.417462 -0.008520 0.055401 0.232455 -0.152047 -0.114103 -0.113768 -0.139561 -0.167434 -0.193562 0.273042 0.380011 0.384241 0.396815 -0.298530 -0.127394 -0.104087 0.161305 0.130461 0.122418 0.132295 0.132183 0.195871 0.105871 0.114404 0.097483 0.113109 0.109088 0.124162 0.126490 0.110553 0.122295 0.107596 0.116084 0.124014 0.078604 0.165958
qa: 0.8584 -0.4606 -0.4064 -0.3913 -0.3766 -0.2654 -0.2664 -0.1957 -0.1390 -0.1864 -0.1429 -0.4034 -0.4175 -0.0085 0.0554 0.2325 -0.1520 -0.1141 -0.1138 -0.1396 -0.1674 -0.1936 0.2730 0.3800 0.3842 0.3968 -0.2985 -0.1274 -0.1041 0.1613 0.1305 0.1224 0.1323 0.1322 0.1959 0.1059 0.1144 0.0975 0.1131 0.1091 0.1242 0.1265 0.1106 0.1223 0.1076 0.1161 0.1240 0.0786 0.1660
va: 6.0418 2.0263 2.1034 2.0978 2.1270 2.1478 2.1597 3.0434 3.0701 3.0984 3.1840 2.9695 2.9731 3.9250 3.6361 4.1413 4.0698 3.9629 3.9388 3.9368 3.8993 3.8949 4.4945 4.2254 4.0632 4.0178 3.9312 3.8782 3.8835 1.0647 1.0279 1.0171 0.9998 1.0000 1.0835 0.9941 1.0225 0.9963 0.9889 0.9935 0.9963 1.0223 0.9966 0.9939 0.9970 0.9947 0.9991 0.9953 1.0378
dispcorr: -0.032486862 hartree
energy: -1800.022954612309
dipole: 2.31824 -2.50180 -0.18356 -9.55533 8.97568 -0.57965 -13.61512 11.50430 -2.11083
magnitude: 2.19665 au
magnitude: 5.58344 debye
