program: Orca
programVersion: 4.2.1
elementType: S O O O O O O N N N N N N C C C C C C C C C C C C C C C C H H H H H H H H H H H H H H H H H H H H
charge: 0
multiplicity: 1
keywords: wb97x-d3
keywords: def2-TZVPP
keywords: def2/J RIJCOSX GRIDX6 NOFINALGRIDX
keywords: grid4 nofinalgrid
keywords: scfconv7
keywords: smallprint printgap noloewdin
keywords: NOSOSCF
formula: C16H20N6O6S
InChI: InChI=1S/C16H20N6O6S/c1-22(2)14(23)10-7-5-6-8-11(10)20-29(25,26)21-16(24)19-15-17-12(27-3)9-13(18-15)28-4/h5-9,19-21H,1-4H3
49 atoms
S  1.810706 0.635197 2.129045
O  1.935657 2.047258 1.869617
O  2.157297 0.038886 3.384227
O  -0.021542 -1.996345 -1.015617
O  0.216509 -1.902004 2.257421
O  -5.425598 -0.184483 -1.041504
O  -2.030209 2.98364 -0.905442
N  2.694477 -0.176828 0.965364
N  2.002013 -2.859829 -0.479915
N  0.211622 0.323075 1.761312
N  -1.659657 -0.994198 1.384031
N  -3.540308 -0.591544 0.173904
N  -1.836862 1.036458 0.26748
C  2.526712 0.217493 -0.384526
C  1.827589 -0.569626 -1.304053
C  1.183647 -1.871071 -0.930188
C  3.070157 1.432004 -0.7942
C  1.649769 -0.107385 -2.603685
C  2.89544 1.873115 -2.094033
C  2.179304 1.106939 -3.002695
C  1.400215 -4.10096 -0.037367
C  3.412306 -2.941955 -0.796967
C  -0.349394 -0.926672 1.827223
C  -2.364938 -0.13808 0.571933
C  -4.239059 0.210611 -0.613229
C  -2.538284 1.819932 -0.543003
C  -3.785426 1.459122 -1.025199
C  -5.891345 -1.465525 -0.649087
C  -0.709128 3.309344 -0.494835
H  2.652082 -1.177162 1.137105
H  3.632404 2.024492 -0.087771
H  1.084399 -0.709622 -3.302778
H  3.325288 2.81811 -2.398236
H  2.038026 1.451477 -4.018153
H  -0.302421 1.034143 1.227591
H  2.075534 -4.587895 0.664911
H  1.217771 -4.782315 -0.872569
H  0.462264 -3.907927 0.471701
H  3.59482 -3.714467 -1.549348
H  3.791011 -2.0032 -1.19091
H  3.991931 -3.198573 0.091393
H  -4.359402 2.096775 -1.67948
H  -5.232684 -2.260202 -1.000697
H  -6.870014 -1.574797 -1.109002
H  -5.987206 -1.548123 0.433901
H  -0.493399 4.275094 -0.943646
H  0.019739 2.578523 -0.849953
H  -0.625132 3.397109 0.589307
H  -2.061233 -1.91687 1.455496
totalener: -1799.99041760 hartree
nucrepener: 3313.89759344 hartree
electener: -5113.88801104 hartree
oneelecener: -9056.21948602 hartree
twoeener: 3942.33147497 hartree
kineticenergy: 1793.44132193 hartree
xcener: -149.343294601795 hartree
chargesum: -0.0000000
charge: 0.858452 -0.460465 -0.406266 -0.391536 -0.375405 -0.265315 -0.266415 -0.195386 -0.138302 -0.185916 -0.142848 -0.403094 -0.417090 -0.011180 0.058324 0.232332 -0.151680 -0.116245 -0.116369 -0.137174 -0.167800 -0.194537 0.271697 0.379580 0.384518 0.396746 -0.298545 -0.127216 -0.102225 0.161790 0.130634 0.122603 0.132222 0.132415 0.195414 0.097271 0.105986 0.114958 0.109150 0.124615 0.113006 0.126304 0.110588 0.122267 0.107497 0.123934 0.076232 0.116406 0.166066
qa: 0.8585 -0.4605 -0.4063 -0.3915 -0.3754 -0.2653 -0.2664 -0.1954 -0.1383 -0.1859 -0.1428 -0.4031 -0.4171 -0.0112 0.0583 0.2323 -0.1517 -0.1162 -0.1164 -0.1372 -0.1678 -0.1945 0.2717 0.3796 0.3845 0.3967 -0.2985 -0.1272 -0.1022 0.1618 0.1306 0.1226 0.1322 0.1324 0.1954 0.0973 0.1060 0.1150 0.1092 0.1246 0.1130 0.1263 0.1106 0.1223 0.1075 0.1239 0.0762 0.1164 0.1661
va: 6.0415 2.0266 2.1034 2.0981 2.1284 2.1478 2.1599 3.0424 3.0705 3.0985 3.1845 2.9692 2.9730 3.9262 3.6301 4.1411 4.0644 3.9654 3.9390 3.9324 3.8991 3.8950 4.4954 4.2257 4.0629 4.0174 3.9315 3.8781 3.8837 1.0647 1.0279 1.0174 1.0000 0.9999 1.0845 0.9964 0.9941 1.0221 0.9935 0.9962 0.9888 1.0224 0.9966 0.9939 0.9970 0.9993 0.9961 0.9949 1.0377
dispcorr: -0.032616791 hartree
energy: -1800.023034390296
dipole: 2.48906 -2.66312 -0.17406 -9.68547 9.07888 -0.60659 -13.45456 11.34916 -2.10540
magnitude: 2.19794 au
magnitude: 5.58673 debye
