program: Orca
programVersion: 4.2.1
elementType: S O O O O O O N N N N N N C C C C C C C C C C C C C C C C H H H H H H H H H H H H H H H H H H H H
charge: 0
multiplicity: 1
keywords: wb97x-d3
keywords: def2-TZVPP
keywords: def2/J RIJCOSX GRIDX6 NOFINALGRIDX
keywords: grid4 nofinalgrid
keywords: scfconv7
keywords: smallprint printgap noloewdin
keywords: NOSOSCF
formula: C16H20N6O6S
InChI: InChI=1S/C16H20N6O6S/c1-22(2)14(23)10-7-5-6-8-11(10)20-29(25,26)21-16(24)19-15-17-12(27-3)9-13(18-15)28-4/h5-9,19-21H,1-4H3
49 atoms
S  1.805701 0.568188 2.129219
O  1.950739 1.983742 1.900659
O  2.154453 -0.063116 3.36654
O  -0.08063 -1.941602 -1.056499
O  0.166352 -1.944916 2.219696
O  -5.430974 -0.071159 -1.067288
O  -1.964967 3.017414 -0.886871
N  2.66832 -0.230137 0.940479
N  1.931506 -2.865108 -0.580381
N  0.199197 0.290563 1.770209
N  -1.696177 -0.984989 1.37155
N  -3.56293 -0.530401 0.156611
N  -1.825163 1.058888 0.273855
C  2.509543 0.20064 -0.398681
C  1.79819 -0.55124 -1.337891
C  1.128441 -1.846835 -0.989775
C  3.077955 1.413286 -0.779151
C  1.636814 -0.058765 -2.628318
C  2.918076 1.885771 -2.069782
C  2.193061 1.152848 -2.998624
C  1.311449 -4.104021 -0.157562
C  3.335153 -2.966507 -0.919747
C  -0.383093 -0.951284 1.811238
C  -2.379907 -0.106603 0.564337
C  -4.238219 0.293148 -0.629113
C  -2.502146 1.863217 -0.536746
C  -3.753114 1.533129 -1.030793
C  -5.933092 -1.339769 -0.679869
C  -0.640855 3.310238 -0.460953
H  2.614596 -1.233386 1.08931
H  3.64867 1.978798 -0.057562
H  1.064521 -0.635011 -3.343568
H  3.367837 2.828423 -2.351594
H  2.065126 1.521225 -4.007432
H  -0.3016 1.017123 1.244189
H  0.383882 -3.904499 0.36781
H  1.98603 -4.619357 0.524856
H  1.105501 -4.763059 -1.005048
H  3.724657 -2.02698 -1.300927
H  3.923511 -3.251063 -0.045795
H  3.492004 -3.727042 -1.689849
H  -4.307779 2.187384 -1.685307
H  -5.289443 -2.151161 -1.020538
H  -6.907638 -1.425922 -1.153241
H  -6.046385 -1.417464 0.401806
H  -0.567211 3.392819 0.624325
H  -0.397045 4.271718 -0.904433
H  0.074192 2.563211 -0.810263
H  -2.116341 -1.900327 1.42962
totalener: -1799.99031566 hartree
nucrepener: 3315.63787147 hartree
electener: -5115.62818713 hartree
oneelecener: -9059.70674812 hartree
twoeener: 3944.07856099 hartree
kineticenergy: 1793.44401586 hartree
xcener: -149.343812296489 hartree
chargesum: -0.0000000
charge: 0.858348 -0.460569 -0.406338 -0.391531 -0.374487 -0.265421 -0.266589 -0.195226 -0.138902 -0.185436 -0.144358 -0.402811 -0.415726 -0.006381 0.051711 0.231547 -0.152759 -0.111550 -0.115609 -0.138170 -0.167520 -0.193209 0.272044 0.378533 0.384859 0.396915 -0.298761 -0.127519 -0.100867 0.160962 0.130461 0.122486 0.132314 0.132352 0.195002 0.114618 0.097391 0.105928 0.124087 0.112969 0.109352 0.126585 0.110510 0.122269 0.107659 0.117220 0.123641 0.074224 0.165753
qa: 0.8583 -0.4606 -0.4063 -0.3915 -0.3745 -0.2654 -0.2666 -0.1952 -0.1389 -0.1854 -0.1444 -0.4028 -0.4157 -0.0064 0.0517 0.2315 -0.1528 -0.1116 -0.1156 -0.1382 -0.1675 -0.1932 0.2720 0.3785 0.3849 0.3969 -0.2988 -0.1275 -0.1009 0.1610 0.1305 0.1225 0.1323 0.1324 0.1950 0.1146 0.0974 0.1059 0.1241 0.1130 0.1094 0.1266 0.1105 0.1223 0.1077 0.1172 0.1236 0.0742 0.1658
va: 6.0427 2.0264 2.1032 2.0979 2.1291 2.1478 2.1605 3.0421 3.0708 3.0974 3.1828 2.9694 2.9735 3.9221 3.6374 4.1438 4.0639 3.9599 3.9374 3.9330 3.8991 3.8950 4.4950 4.2275 4.0628 4.0174 3.9315 3.8783 3.8833 1.0646 1.0283 1.0168 1.0000 1.0000 1.0857 1.0223 0.9962 0.9939 0.9963 0.9890 0.9933 1.0222 0.9967 0.9938 0.9969 0.9951 0.9996 0.9967 1.0378
dispcorr: -0.032728967 hartree
energy: -1800.023044625098
dipole: 2.32961 -2.50795 -0.17834 -9.44158 8.86636 -0.57522 -13.80322 11.66023 -2.14299
magnitude: 2.22600 au
magnitude: 5.65805 debye
