program: Orca
programVersion: 4.2.1
elementType: S O O O O O O N N N N N N C C C C C C C C C C C C C C C C H H H H H H H H H H H H H H H H H H H H
charge: 0
multiplicity: 1
keywords: wb97x-d3
keywords: def2-TZVPP
keywords: def2/J RIJCOSX GRIDX6 NOFINALGRIDX
keywords: grid4 nofinalgrid
keywords: scfconv7
keywords: smallprint printgap noloewdin
keywords: NOSOSCF
formula: C16H20N6O6S
InChI: InChI=1S/C16H20N6O6S/c1-22(2)14(23)10-7-5-6-8-11(10)20-29(25,26)21-16(24)19-15-17-12(27-3)9-13(18-15)28-4/h5-9,19-21H,1-4H3
49 atoms
S  1.781628 0.638391 2.004399
O  1.923702 2.039074 1.695927
O  2.048988 0.093764 3.302752
O  0.050682 -1.639649 -1.266805
O  0.271169 -1.925884 1.986369
O  -5.624514 -0.161474 -0.824469
O  -2.360729 3.136367 -0.598788
N  2.72858 -0.219336 0.935981
N  1.887753 -2.860714 -0.742412
N  0.20259 0.309967 1.569113
N  -1.661865 -1.030299 1.235976
N  -3.638147 -0.597758 0.205716
N  -1.993035 1.087683 0.336415
C  2.769118 0.18357 -0.421437
C  2.115798 -0.531191 -1.426846
C  1.256426 -1.727683 -1.137752
C  3.495468 1.324529 -0.74872
C  2.182001 -0.078179 -2.739934
C  3.558381 1.761041 -2.059764
C  2.901329 1.059649 -3.060346
C  1.116684 -4.030743 -0.386001
C  3.314908 -3.073489 -0.805738
C  -0.335192 -0.947249 1.618426
C  -2.453397 -0.132378 0.56112
C  -4.424846 0.244181 -0.445086
C  -2.787844 1.915906 -0.330941
C  -4.052926 1.547077 -0.757675
C  -6.012591 -1.491797 -0.522293
C  -1.043451 3.500527 -0.210558
H  2.646092 -1.214732 1.114324
H  4.013905 1.860924 0.032516
H  1.657535 -0.624004 -3.513415
H  4.128429 2.648159 -2.30074
H  2.948939 1.397863 -4.086639
H  -0.345436 1.043488 1.106347
H  0.063012 -3.783478 -0.33457
H  1.433768 -4.403682 0.588332
H  1.257751 -4.823374 -1.125138
H  3.544641 -3.897759 -1.485816
H  3.838472 -2.193455 -1.167365
H  3.71667 -3.33653 0.176056
H  -4.700732 2.220716 -1.296782
H  -5.351414 -2.222263 -0.98927
H  -7.016587 -1.602401 -0.923439
H  -6.028392 -1.67529 0.552404
H  -0.909913 3.464491 0.871534
H  -0.911196 4.524498 -0.548787
H  -0.289692 2.868339 -0.682391
H  -2.037436 -1.96543 1.274972
totalener: -1799.99144779 hartree
nucrepener: 3277.83287137 hartree
electener: -5077.82431916 hartree
oneelecener: -8984.31583513 hartree
twoeener: 3906.49151597 hartree
kineticenergy: 1793.44420131 hartree
xcener: -149.346796826767 hartree
chargesum: -0.0000000
charge: 0.858836 -0.461203 -0.410605 -0.397706 -0.391182 -0.265399 -0.264795 -0.204880 -0.101640 -0.190336 -0.138688 -0.407382 -0.420384 0.051504 0.013550 0.208780 -0.159938 -0.106690 -0.091423 -0.152552 -0.175739 -0.201698 0.282664 0.384820 0.384669 0.398059 -0.301088 -0.127120 -0.125632 0.160927 0.126498 0.120397 0.130893 0.130660 0.199827 0.107508 0.113888 0.104966 0.104747 0.126458 0.113716 0.126903 0.109616 0.122498 0.107491 0.110349 0.126154 0.105875 0.163832
qa: 0.8588 -0.4612 -0.4106 -0.3977 -0.3912 -0.2654 -0.2648 -0.2049 -0.1016 -0.1903 -0.1387 -0.4074 -0.4204 0.0515 0.0135 0.2088 -0.1599 -0.1067 -0.0914 -0.1526 -0.1757 -0.2017 0.2827 0.3848 0.3847 0.3981 -0.3011 -0.1271 -0.1256 0.1609 0.1265 0.1204 0.1309 0.1307 0.1998 0.1075 0.1139 0.1050 0.1047 0.1265 0.1137 0.1269 0.1096 0.1225 0.1075 0.1103 0.1262 0.1059 0.1638
va: 6.0439 2.0264 2.1004 2.0915 2.1151 2.1481 2.1576 3.0532 3.0912 3.0936 3.1820 2.9694 2.9733 3.8668 3.7048 4.1815 4.1166 3.9636 3.9382 3.9608 3.8788 3.8985 4.4905 4.2203 4.0625 4.0230 3.9340 3.8785 3.8768 1.0608 1.0276 1.0143 0.9990 1.0001 1.0760 1.0304 0.9951 0.9953 0.9973 0.9958 0.9865 1.0223 0.9967 0.9940 0.9970 0.9945 0.9961 0.9929 1.0391
dispcorr: -0.031082976 hartree
energy: -1800.022530766281
dipole: 2.13343 -2.33474 -0.20130 -10.17032 9.42860 -0.74171 -12.59660 10.70314 -1.89346
magnitude: 2.04349 au
magnitude: 5.19414 debye
