program: Orca
programVersion: 5.0.2
elementType: S O O O O O O N N N N N C C C C C C C C C C C C C C C H H H H H H H H H H H H H H H H H
charge: 0
multiplicity: 1
keywords: wb97x-d3
keywords: def2-TZVPP
keywords: def2/J RIJCOSX
keywords: DEFGRID2
keywords: scfconv7
keywords: smallprint printgap noloewdin
keywords: NOSOSCF
formula: C15H17N5O6S
InChI: InChI=1S/C15H17N5O6S/c1-9-16-13(18-14(17-9)26-4)20(2)15(22)19-27(23,24)11-8-6-5-7-10(11)12(21)25-3/h5-8,19H,1-4H3
44 atoms
S  1.64739 -0.14879 -1.558672
O  1.968098 -0.991337 -2.693289
O  1.646482 1.296591 -1.723065
O  0.809667 1.231223 1.229497
O  0.556943 -2.604794 -0.428275
O  2.58735 2.585611 1.315358
O  -3.139383 2.336727 -1.195337
N  0.10902 -0.487538 -1.033217
N  -1.488135 -1.762782 0.130094
N  -3.567352 -1.044163 0.801499
N  -2.267449 0.329734 -0.574179
N  -4.392517 1.051372 0.116741
C  2.749058 -0.566713 -0.231709
C  2.906576 0.275134 0.87067
C  3.55229 -1.684834 -0.397121
C  3.891917 -0.027333 1.801593
C  -0.224931 -1.6770 -0.455547
C  4.513013 -1.985103 0.55534
C  4.682998 -1.156951 1.651886
C  2.093907 1.500773 1.13512
C  -2.465228 -0.786796 0.11821
C  -1.806438 -3.005349 0.838328
C  -4.501324 -0.095843 0.769786
C  -3.251997 1.207743 -0.537657
C  -5.768028 -0.36262 1.498068
C  -0.076218 2.323178 1.506429
C  -1.950687 2.589168 -1.947661
H  -0.583808 0.275598 -1.028515
H  3.445171 -2.323083 -1.261715
H  4.034171 0.618079 2.657998
H  5.131767 -2.862475 0.428709
H  5.437645 -1.383143 2.392538
H  -0.961832 -3.678333 0.779239
H  -2.014076 -2.803652 1.885355
H  -2.668925 -3.490927 0.389506
H  -6.280484 0.560901 1.754803
H  -6.432417 -0.945641 0.855817
H  -5.590664 -0.94733 2.397818
H  -0.031656 3.075641 0.720401
H  -1.072703 1.894662 1.548667
H  0.158869 2.782496 2.466109
H  -1.791449 1.828016 -2.71067
H  -1.076874 2.651345 -1.300107
H  -2.107262 3.550784 -2.427405
elementType: S O N C H
totalener: -1705.33767090 hartree
nucrepener: 2922.69652548 hartree
electener: -4628.03419638 hartree
oneelecener: -8146.82979705 hartree
twoeener: 3518.79560068 hartree
cpcmener: -0.05523577 hartree
kineticenergy: 1699.18132605 hartree
xcener: -140.063245424248 hartree
chargesum: -0.0000000
charge: 0.897597 -0.513337 -0.528229 -0.257373 -0.492432 -0.458425 -0.276488 -0.191098 -0.088993 -0.429525 -0.425455 -0.371974 -0.149510 0.085496 -0.007871 -0.207280 0.396837 -0.165918 -0.103240 0.471389 0.417660 -0.156129 0.324834 0.448256 -0.250261 -0.146526 -0.123038 0.221204 0.149454 0.153207 0.167578 0.167858 0.118846 0.115054 0.117917 0.099464 0.116721 0.102464 0.128747 0.123716 0.143612 0.125817 0.109944 0.139430
qa: 0.8976 -0.5133 -0.5282 -0.2574 -0.4924 -0.4584 -0.2765 -0.1911 -0.0890 -0.4295 -0.4255 -0.3720 -0.1495 0.0855 -0.0079 -0.2073 0.3968 -0.1659 -0.1032 0.4714 0.4177 -0.1561 0.3248 0.4483 -0.2503 -0.1465 -0.1230 0.2212 0.1495 0.1532 0.1676 0.1679 0.1188 0.1151 0.1179 0.0995 0.1167 0.1025 0.1287 0.1237 0.1436 0.1258 0.1099 0.1394
va: 5.7802 1.9836 1.9549 2.1242 2.0266 2.0410 2.1317 3.1000 3.2446 2.9920 2.9409 3.0033 3.8341 3.6854 3.8254 4.0247 4.3071 3.9561 3.9002 4.0737 4.1098 3.8434 3.9652 4.2444 3.9318 3.8387 3.8538 1.0523 1.0207 1.0065 0.9872 0.9857 1.0227 1.0002 0.9995 1.0136 0.9986 1.0100 0.9835 0.9975 0.9977 0.9926 0.9770 0.9967
dispcorr: -0.026614536 hartree
energy: -1705.364285434402
dipole: -11.71573 10.09054 -1.62519 -0.56184 -0.28750 -0.84933 9.67487 -7.32939 2.34548
magnitude: 2.97723 au
magnitude: 7.56751 debye
